Image 01
profile-image

Warmaster

Claus Claus Paludan
SlideShow (GL)

Screensavers by wjarosz 58 comments

In file included from kslidesaversetup.cpp:22:
kslidesaversetup.ui.h: In member function `virtual void KSlideSaverSetup::init()':
kslidesaversetup.ui.h:32: `KFile' undeclared (first use this function)
kslidesaversetup.ui.h:32: (Each undeclared identifier is reported only once for each function it appears in.)
kslidesaversetup.ui.h:32: parse error before `::' token
kslidesaversetup.ui.h:35: `mode' undeclared (first use this function)
In file included from kslidesaversetup.cpp:22:
kslidesaversetup.ui.h: In member function `virtual void KSlideSaverSetup::writeConfig()':
kslidesaversetup.ui.h:82: invalid use of undefined type `struct KURLRequester'
kslidesaversetup.h:22: forward declaration of `struct KURLRequester'
In file included from kslidesaversetup.cpp:22:
kslidesaversetup.ui.h: In member function `virtual void KSlideSaverSetup::readConfig()':
kslidesaversetup.ui.h:93: invalid use of undefined type `struct KURLRequester'
kslidesaversetup.h:22: forward declaration of `struct KURLRequester'
kslidesaversetup.cpp: In constructor `KSlideSaverSetup::KSlideSaverSetup(QWidget*, const char*, bool, unsigned int)':
kslidesaversetup.cpp:104: invalid use of undefined type `struct KURLRequester'
kslidesaversetup.h:22: forward declaration of `struct KURLRequester'
kslidesaversetup.cpp:105: invalid use of undefined type `struct KURLRequester'
kslidesaversetup.h:22: forward declaration of `struct KURLRequester'
kslidesaversetup.cpp:107: no matching function for call to `QGridLayout::addMultiCellWidget(KURLRequester*&, int, int, int, int)'
/usr/lib/qt3/include/qlayout.h:326: candidates are: void QGridLayout::addMultiCellWidget(QWidget*, int, int, int, int, int = 0)
kslidesaversetup.cpp:196: no matching function for call to `KSlideSaverSetup::connect(KURLRequester*&, const char[31], KSlideSaverSetup* const, const char[30])'
/usr/lib/qt3/include/qobject.h:116: candidates are: static bool QObject::connect(const QObject*, const char*, const QObject*, const char*)
/usr/lib/qt3/include/qobject.h:227: bool QObject::connect(const QObject*, const char*, const char*) const
kslidesaversetup.cpp:197: no matching function for call to `KSlideSaverSetup::connect(KURLRequester*&, const char[29], KSlideSaverSetup* const, const char[30])'
/usr/lib/qt3/include/qobject.h:116: candidates are: static bool QObject::connect(const QObject*, const char*, const QObject*, const char*)
/usr/lib/qt3/include/qobject.h:227: bool QObject::connect(const QObject*, const char*, const char*) const
kslidesaversetup.cpp:202: no matching function for call to `QWidget::setTabOrder(QSlider*&, KURLRequester*&)'
/usr/lib/qt3/include/qwidget.h:307: candidates are: static void QWidget::setTabOrder(QWidget*, QWidget*)
kslidesaversetup.cpp:203: no matching function for call to `QWidget::setTabOrder(KURLRequester*&, QPushButton*&)'
/usr/lib/qt3/include/qwidget.h:307: candidates are: static void QWidget::setTabOrder(QWidget*, QWidget*)
kslidesaversetup.cpp: In member function `virtual void KSlideSaverSetup::languageChange()':
kslidesaversetup.cpp:226: no matching function for call to `QToolTip::add(KURLRequester*&, QString)'
/usr/lib/qt3/include/qtooltip.h:90: candidates are: static void QToolTip::add(QWidget*, const QString&)
/usr/lib/qt3/include/qtooltip.h:92: static void QToolTip::add(QWidget*, const QString&, QToolTipGroup*, const QString&)
/usr/lib/qt3/include/qtooltip.h:95: static void QToolTip::add(QWidget*, const QRect&, const QString&)
/usr/lib/qt3/include/qtooltip.h:97: static void QToolTip::add(QWidget*, const QRect&, const QString&, QToolTipGroup*, const QString&)
kslidesaversetup.cpp:227: no matching function for call to `QWhatsThis::add(KURLRequester*&, QString)'
/usr/lib/qt3/include/qwhatsthis.h:63: candidates are: static void QWhatsThis::add(QWidget*, const QString&)
make[3]: *** [kslidesaversetup.o] Error 1
make[3]: Leaving directory `/home/claus/files/downloads/kslidesavergl-0.7/kslidesavergl'
make[2]: *** [all-recursive] Error 1
make[2]: Leaving directory `/home/claus/files/downloads/kslidesavergl-0.7/kslidesavergl'
make[1]: *** [all-recursive] Error 1
make[1]: Leaving directory `/home/claus/files/downloads/kslidesavergl-0.7'
make: *** [all] Error 2



As I haven't been able to find any rpm the compile way was the only one to take, but alas it fails as shown above..

If anyone has a link til a rpm download it would be much appriciated. I need this fine screen saver in my mandrake :)

cheers - Jun 19 2003