Image 01
profile-image

vonschutter

stephan schutter
test
Seven P7asma Mix.

Plasma Themes 10 comments

Score 76.0%
Mar 12 2009
So how do you install this stuff? I looked in the zip file and could not find any instructions... - Mar 13 2009
Clearlooks

Metacity Themes 62 comments

Score 50.0%
Jul 11 2005
./configure: line 10830: --variable=gtk_binary_version: command not found
checking for pkg-config... no
*** The pkg-config script could not be found. Make sure it is
*** in your path, or set the PKG_CONFIG environment variable
*** to the full path to pkg-config.
*** Or see http://www.freedesktop.org/software/pkgconfig to get pkg-config.
configure: error: GTK+-2.0 is required to compile clearlooks-engine - Apr 02 2005
Improved AKDC Kwin themes ebuilds

KDE 3.x Window Decorations 11 comments

Score 50.0%
Feb 07 2005
what do I do with these files? I tried "sh akdc-kwin-themes-1.0.ebuild" but it does not seem to be a script... how do you install these? - Feb 07 2005
AKDC Beta3 preview 2(see changelog)

KDE 3.x Window Decorations 357 comments

Score 50.0%
Dec 20 2004
I triedeverything --- none of these compile on mandrake... (10.1)

looks like wrong QT?


softcrystal.h:143: error: expected class-name before '{' token
softcrystal.h:148: error: `BorderSize' was not declared in this scope
softcrystal.h:148: error: template argument 1 is invalid
softcrystal.h:148: error: ISO C++ forbids declaration of `borderSizes' with no type
softcrystal.h:150: error: ISO C++ forbids declaration of `KDecoration' with no type
softcrystal.h:150: error: `KDecoration' declared as a `virtual' field
softcrystal.h:150: error: expected `;' before '*' token
softcrystal.h:143: warning: `class SoftCrystal::SoftCrystalHandler' has virtual functions but non-virtual destructor
softcrystal.h:307: error: expected class-name before '{' token
softcrystal.h:312: error: expected `)' before '*' token
softcrystal.h:326: error: `Position' does not name a type
softcrystal.h:307: warning: `class SoftCrystal::SoftCrystalClient' has virtual functions but non-virtual destructor
softcrystal.h: In member function `int SoftCrystal::SoftCrystalClient::width() const':
softcrystal.h:358: error: `widget' undeclared (first use this function)
softcrystal.h:358: error: (Each undeclared identifier is reported only once for each function it appears in.)
softcrystal.h: In member function `int SoftCrystal::SoftCrystalClient::height() const':
softcrystal.h:363: error: `widget' undeclared (first use this function)
softcrystal.h: In member function `bool SoftCrystal::SoftCrystalClient::maximizedVertical() const':
softcrystal.h:368: error: `maximizeMode' undeclared (first use this function)
softcrystal.h:368: error: `MaximizeVertical' undeclared (first use this function)
In file included from softcrystal.cpp:44:
softcrystal.moc: In static member function `static QMetaObject* SoftCrystal::SoftCrystalClient::staticMetaObject()':
softcrystal.moc:54: error: `KDecoration' has not been declared
softcrystal.moc: In member function `virtual void* SoftCrystal::SoftCrystalClient::qt_cast(const char*)':
softcrystal.moc:78: error: `KDecoration' has not been declared
softcrystal.moc: In member function `virtual bool SoftCrystal::SoftCrystalClient::qt_invoke(int, QUObject*)':
softcrystal.moc:87: error: `KDecoration' has not been declared
softcrystal.moc: In member function `virtual bool SoftCrystal::SoftCrystalClient::qt_emit(int, QUObject*)':
softcrystal.moc:94: error: `KDecoration' has not been declared
softcrystal.moc: In member function `virtual bool SoftCrystal::SoftCrystalClient::qt_property(int, int, QVariant*)':
softcrystal.moc:100: error: `KDecoration' has not been declared
softcrystal.cpp: In member function `void SoftCrystal::SoftCrystalHandler::createPixmaps()':
softcrystal.cpp:101: error: `options' undeclared (first use this function)
softcrystal.cpp:103: error: `BorderLarge' undeclared (first use this function)
softcrystal.cpp:107: error: `BorderVeryLarge' undeclared (first use this function)
softcrystal.cpp:111: error: `BorderTiny' undeclared (first use this function)
softcrystal.cpp:112: error: `BorderNormal' undeclared (first use this function)
softcrystal.cpp:126: error: `KDecoration' has not been declared
softcrystal.cpp:126: error: `ColorTitleBar' undeclared (first use this function)
softcrystal.cpp:127: error: `KDecoration' has not been declared
softcrystal.cpp:127: error: `ColorTitleBlend' undeclared (first use this function)
softcrystal.cpp:157: error: `KDecoration' has not been declared
softcrystal.cpp:158: error: `KDecoration' has not been declared
softcrystal.cpp: In member function `virtual bool SoftCrystal::SoftCrystalHandler::reset(long unsigned int)':
softcrystal.cpp:630: error: `SettingBorder' undeclared (first use this function)
softcrystal.cpp:635: error: `SettingFont' undeclared (first use this function)
softcrystal.cpp:641: error: `SettingColors' undeclared (first use this function)
softcrystal.cpp:647: error: `SettingButtons' undeclared (first use this function)
softcrystal.cpp:653: error: `SettingTooltips' undeclared (first use this function)
softcrystal.cpp:674: error: `resetDecorations' undeclared (first use this function)
softcrystal.cpp: At global scope:
softcrystal.cpp:749: error: expected constructor, destructor, or type conversion before '*' token
softcrystal.cpp:749: error: expected `,' or `;' before '*' token
softcrystal.cpp:754: error: `BorderSize' is not a member of `SoftCrystal::SoftCrystalHandler'
softcrystal.cpp:754: error: `BorderSize' is not a member of `SoftCrystal::SoftCrystalHandler'
softcrystal.cpp:754: error: template argument 1 is invalid
softcrystal.cpp:755: error: ISO C++ forbids declaration of `borderSizes' with no type
softcrystal.cpp: In member function `virtual int SoftCrystal::SoftCrystalHandler::borderSizes() const':
softcrystal.cpp:756: error: `BorderSize' undeclared (first use this function)
softcrystal.cpp:756: error: template argument 1 is invalid
softcrystal.cpp:756: error: `BorderNormal' undeclared (first use this function)
softcrystal.cpp:756: error: `BorderLarge' undeclared (first use this function)
softcrystal.cpp:757: error: `BorderVeryLarge' undeclared (first use this function)
softcrystal.cpp: In constructor `SoftCrystal::SoftCrystalButton::SoftCrystalButton(SoftCrystal::SoftCrystalClient*, const char*, SoftCrystal::Button, const QString&, bool, int)':
softcrystal.cpp:761: error: 'class SoftCrystal::SoftCrystalClient' has no member named 'widget'
softcrystal.cpp:774: error: 'class SoftCrystal::SoftCrystalClient' has no member named 'isActive'
softcrystal.cpp:775: error: 'class SoftCrystal::SoftCrystalClient' has no member named 'isActive'
softcrystal.cpp: In member function `virtual void SoftCrystal::SoftCrystalButton::drawButton(QPainter*)':
softcrystal.cpp:826: error: 'class SoftCrystal::SoftCrystalClient' has no member named 'isActive'
softcrystal.cpp:826: error: 'class SoftCrystal::SoftCrystalClient' has no member named 'isActive'
softcrystal.cpp:875: error: 'class SoftCrystal::SoftCrystalClient' has no member named 'isActive'
softcrystal.cpp:879: error: 'class SoftCrystal::SoftCrystalClient' has no member named 'isActive'
softcrystal.cpp:883: error: 'class SoftCrystal::SoftCrystalClient' has no member named 'maximizeMode'
softcrystal.cpp:883: error: `MaximizeFull' is not a member of `SoftCrystal::SoftCrystalClient'
softcrystal.cpp:883: error: 'class SoftCrystal::SoftCrystalClient' has no member named 'isActive'
softcrystal.cpp:887: error: 'class SoftCrystal::SoftCrystalClient' has no member named 'isActive'
softcrystal.cpp: At global scope:
softcrystal.cpp:1019: error: expected `)' before '*' token
softcrystal.cpp:1019: error: expected `,' or `;' before '*' token
softcrystal.cpp: In member function `virtual void SoftCrystal::SoftCrystalClient::init()':
softcrystal.cpp:1039: error: `WStaticContents' undeclared (first use this function)
softcrystal.cpp:1039: error: `WNoAutoErase' undeclared (first use this function)
softcrystal.cpp:1039: error: `createMainWidget' undeclared (first use this function)
softcrystal.cpp:1040: error: `widget' undeclared (first use this function)
softcrystal.cpp: In member function `void SoftCrystal::SoftCrystalClient::createLayout()':
softcrystal.cpp:1068: error: `widget' undeclared (first use this function)
softcrystal.cpp:1083: error: `isActive' undeclared (first use this function)
softcrystal.cpp:1113: error: `options' undeclared (first use this function)
softcrystal.cpp:1153: error: `isPreview' undeclared (first use this function)
softcrystal.cpp: In member function `virtual void SoftCrystal::SoftCrystalClient::reset(long unsigned int)':
softcrystal.cpp:1176: error: `widget' undeclared (first use this function)
softcrystal.cpp: In member function `void SoftCrystal::SoftCrystalClient::addButtons(QBoxLayout*, const QString&)':
softcrystal.cpp:1219: error: `LeftButton' undeclared (first use this function)
softcrystal.cpp:1219: error: `MidButton' undeclared (first use this function)
softcrystal.cpp:1219: error: `RightButton' undeclared (first use this function)
softcrystal.cpp:1227: error: `isMinimizable' undeclared (first use this function)
softcrystal.cpp:1230: error: `connect' undeclared (first use this function)
softcrystal.cpp:1244: error: `isMaximizable' undeclared (first use this function)
softcrystal.cpp:1261: error: `isCloseable' undeclared (first use this function)
softcrystal.cpp:1282: error: `providesContextHelp' undeclared (first use this function)
softcrystal.cpp: In member function `void SoftCrystal::SoftCrystalClient::updateMask()':
softcrystal.cpp:1331: error: `setMask' undeclared (first use this function)
softcrystal.cpp: In member function `virtual void SoftCrystal::SoftCrystalClient::captionChange()':
softcrystal.cpp:1339: error: `widget' undeclared (first use this function)
softcrystal.cpp:1339: error: `isActive' undeclared (first use this function)
softcrystal.cpp: In member function `void SoftCrystal::SoftCrystalClient::iconChange()':
softcrystal.cpp:1361: error: `widget' undeclared (first use this function)
softcrystal.cpp:1361: error: `isActive' undeclared (first use this function)
softcrystal.cpp: In member function `void SoftCrystal::SoftCrystalClient::drawAppIcon(QPainter&)':
softcrystal.cpp:1373: error: `isActive' undeclared (first use this function)
softcrystal.cpp:1376: error: 'class SoftCrystal::SoftCrystalClient' has no member named 'icon'
softcrystal.cpp:1376: error: incomplete type `QIconSet' used in nested name specifier
softcrystal.cpp:1376: error: incomplete type `QIconSet' used in nested name specifier
softcrystal.cpp:1383: error: 'class SoftCrystal::SoftCrystalClient' has no member named 'icon'
softcrystal.cpp:1383: error: incomplete type `QIconSet' used in nested name specifier
softcrystal.cpp:1383: error: incomplete type `QIconSet' used in nested name specifier
softcrystal.cpp: In member function `void SoftCrystal::SoftCrystalClient::drawCaptionText(QPainter&)':
softcrystal.cpp:1424: error: 'class SoftCrystal::SoftCrystalHandler' has no member named 'options'
softcrystal.cpp:1424: error: `isActive' undeclared (first use this function)
softcrystal.cpp:1429: error: `AlignLeft' undeclared (first use this function)
softcrystal.cpp:1429: error: `AlignVCenter' undeclared (first use this function)
softcrystal.cpp:1429: error: `SingleLine' undeclared (first use this function)
softcrystal.cpp:1432: error: `AlignCenter' undeclared (first use this function)
softcrystal.cpp:1435: error: `AlignRight' undeclared (first use this function)
softcrystal.cpp:1462: error: `caption' undeclared (first use this function)
softcrystal.cpp:1478: error: `options' undeclared (first use this function)
softcrystal.cpp:1478: error: `ColorFont' undeclared (first use this function)
softcrystal.cpp: In member function `void SoftCrystal::SoftCrystalClient::drawTitlebar(QPainter&, QRect&)':
softcrystal.cpp:1499: error: `isActive' undeclared (first use this function)
softcrystal.cpp: In member function `void SoftCrystal::SoftCrystalClient::drawFrame(QPainter&, QRect&, QPaintEvent*)':
softcrystal.cpp:1542: error: `isActive' undeclared (first use this function)
softcrystal.cpp: In member function `int SoftCrystal::SoftCrystalClient::BttWidthOnLeft()':
softcrystal.cpp:1615: error: `options' undeclared (first use this function)
softcrystal.cpp:1639: error: `isMinimizable' undeclared (first use this function)
softcrystal.cpp:1640: error: `isActive' undeclared (first use this function)
softcrystal.cpp:1641: error: `isMaximizable' undeclared (first use this function)
softcrystal.cpp:1643: error: `isCloseable' undeclared (first use this function)
softcrystal.cpp:1645: error: `providesContextHelp' undeclared (first use this function)
softcrystal.cpp: In member function `int SoftCrystal::SoftCrystalClient::BttWidthOnRight()':
softcrystal.cpp:1671: error: `options' undeclared (first use this function)
softcrystal.cpp:1695: error: `isMinimizable' undeclared (first use this function)
softcrystal.cpp:1696: error: `isActive' undeclared (first use this function)
softcrystal.cpp:1697: error: `isMaximizable' undeclared (first use this function)
softcrystal.cpp:1699: error: `isCloseable' undeclared (first use this function)
softcrystal.cpp:1701: error: `providesContextHelp' undeclared (first use this function)
softcrystal.cpp: In member function `virtual void SoftCrystal::SoftCrystalClient::activeChange()':
softcrystal.cpp:1737: error: `widget' undeclared (first use this function)
softcrystal.cpp: In member function `virtual void SoftCrystal::SoftCrystalClient::maximizeChange()':
softcrystal.cpp:1757: error: `maximizeMode' undeclared (first use this function)
softcrystal.cpp:1757: error: `MaximizeFull' undeclared (first use this function)
softcrystal.cpp:1760: error: `widget' undeclared (first use this function)
softcrystal.cpp: In member function `void SoftCrystal::SoftCrystalClient::slotMaximize()':
softcrystal.cpp:1800: error: `MidButton' undeclared (first use this function)
softcrystal.cpp:1801: error: `maximizeMode' undeclared (first use this function)
softcrystal.cpp:1801: error: `MaximizeVertical' undeclared (first use this function)
softcrystal.cpp:1801: error: `maximize' undeclared (first use this function)
softcrystal.cpp:1804: error: `RightButton' undeclared (first use this function)
softcrystal.cpp:1805: error: `MaximizeHorizontal' undeclared (first use this function)
softcrystal.cpp:1808: error: `LeftButton' undeclared (first use this function)
softcrystal.cpp:1809: error: `MaximizeFull' undeclared (first use this function)
softcrystal.cpp:1809: error: `MaximizeRestore' undeclared (first use this function)
softcrystal.cpp: In member function `void SoftCrystal::SoftCrystalClient::paintEvent(QPaintEvent*)':
softcrystal.cpp:1852: error: `widget' undeclared (first use this function)
softcrystal.cpp: In member function `void SoftCrystal::SoftCrystalClient::resizeEvent(QResizeEvent*)':
softcrystal.cpp:1871: error: `widget' undeclared (first use this function)
softcrystal.cpp:1897: error: no matching function for call to `QApplication::postEvent(SoftCrystal::SoftCrystalClient* const, QPaintEvent*)'
/usr/lib/qt3//include/qapplication.h:151: note: candidates are: static void QApplication::postEvent(QObject*, QEvent*)
softcrystal.cpp: In member function `void SoftCrystal::SoftCrystalClient::mouseDoubleClickEvent(QMouseEvent*)':
softcrystal.cpp:1906: error: `titlebarDblClickOperation' undeclared (first use this function)
softcrystal.cpp: At global scope:
softcrystal.cpp:1910: error: expected constructor, destructor, or type conversion before "SoftCrystalClient"
softcrystal.cpp:1910: error: expected `,' or `;' before "SoftCrystalClient"
softcrystal.cpp: In member function `virtual void SoftCrystal::SoftCrystalClient::resize(const QSize&)':
softcrystal.cpp:1994: error: `widget' undeclared (first use this function)
softcrystal.cpp: In member function `virtual void SoftCrystal::SoftCrystalClient::borders(int&, int&, int&, int&) const':
softcrystal.cpp:2002: error: `isActive' undeclared (first use this function)
softcrystal.cpp:2010: error: `maximizeMode' undeclared (first use this function)
softcrystal.cpp:2010: error: `MaximizeHorizontal' undeclared (first use this function)
softcrystal.cpp:2010: error: `options' undeclared (first use this function)
softcrystal.cpp:2012: error: `MaximizeVertical' undeclared (first use this function)
softcrystal.cpp: In member function `virtual QSize SoftCrystal::SoftCrystalClient::minimumSize() const':
softcrystal.cpp:2023: error: `widget' undeclared (first use this function)
softcrystal.cpp: In member function `virtual bool SoftCrystal::SoftCrystalClient::eventFilter(QObject*, QEvent*)':
softcrystal.cpp:2029: error: `widget' undeclared (first use this function)
softcrystal.cpp:2047: error: `processMousePressEvent' undeclared (first use this function)
softcrystal.cpp: At global scope:
softcrystal.cpp:2060: error: expected constructor, destructor, or type conversion before '*' token
softcrystal.cpp:2060: error: expected `,' or `;' before '*' token
softcrystal.cpp:761: warning: unused parameter 'bttstate'
softcrystal.cpp:761: warning: unused parameter 'bttstate'
make[3]: *** [softcrystal.lo] Error 1
make[3]: Leaving directory `/home/stephans/downloads/border/softcrystal-1.0-3.2.0/kwin'
make[2]: *** [all-recursive] Error 1
make[2]: Leaving directory `/home/stephans/downloads/border/softcrystal-1.0-3.2.0/kwin'
make[1]: *** [all-recursive] Error 1
make[1]: Leaving directory `/home/stephans/downloads/border/softcrystal-1.0-3.2.0'
make: *** [all] Error 2 - Nov 21 2004