Image 01
profile-image

tin

Gilberto Tin
oxygen-transparent

QtCurve by HugoPereira 546 comments

Sorry, I only noticed it was not the same error after I posted the reply but thanks for the quick answer. - Nov 28 2012
oxygen-transparent

QtCurve by HugoPereira 546 comments

I am having the same error when running with latest kubuntu 12.10 and kde 4.9.2. I ran the the setup perl script with the default branch master.

sudo ./oxygen-setup.pl --branch master
[ 16%] Building CXX object decoration/CMakeFiles/kwin3_oxygen_transparent.dir/oxygenclient.o
/home/developer/oxygen-transparent/src/decoration/oxygenclient.cpp: In member function ‘virtual void Oxygen::Client::init()’:
/home/developer/oxygen-transparent/src/decoration/oxygenclient.cpp:128:39: error: ‘setAlphaEnabled’ was not declared in this scope
/home/developer/oxygen-transparent/src/decoration/oxygenclient.cpp: In member function ‘virtual KCommonDecorationButton* Oxygen::Client::createButton(ButtonType)’:
/home/developer/oxygen-transparent/src/decoration/oxygenclient.cpp:220:18: error: ‘AppMenuButton’ was not declared in this scope
/home/developer/oxygen-transparent/src/decoration/oxygenclient.cpp: In member function ‘virtual void Oxygen::Client::maximizeChange()’:
/home/developer/oxygen-transparent/src/decoration/oxygenclient.cpp:1365:39: error: ‘setAlphaEnabled’ was not declared in this scope
make[2]: *** [decoration/CMakeFiles/kwin3_oxygen_transparent.dir/oxygenclient.o] Error 1
make[1]: *** [decoration/CMakeFiles/kwin3_oxygen_transparent.dir/all] Error 2
make: *** [all] Error 2
system make>&1 failed: 512
- Nov 28 2012