Image 01
profile-image

Savagearth

Savage Earth
Mallory

KDE 3.x Window Decorations by Maxilys 39 comments

I love your concept, but dislike those icon, they don't fit with it. If you can improve on them your gonna made to the top10 of most wanted easily :P

Good Jobs - Mar 09 2005
TDE - T Desktop Enhancements

Karamba & Superkaramba by chip2003 61 comments

I have already try that, the problem is the calendar number is 1 row offset up. I'm maybe not clear on that but try it you'll see what I mean.

Thanks to answer me. - Dec 22 2003
TDE - T Desktop Enhancements

Karamba & Superkaramba by chip2003 61 comments

I would like to know how to make tcal start on sunday.

Nice job man. - Dec 20 2003
KMix, KLaptop don't obey color scheme

Various KDE 1.-4. Improvements by encee 3 comments

For kmix, check this http://www.kde-look.org/content/show.php?content=7326, but for the other one I can't help, Sorry. - Nov 26 2003
Knifty (KDE >= 3.2)

KDE 3.x Window Decorations by ceebx 78 comments

I can't compile under Mandrake 10.0 (Cooker)

here's my output:

knifty.h:13:25: kdecoration.h: No such file or directory
knifty.h:14:32: kdecorationfactory.h: No such file or directory
In file included from knifty.cpp:12:
knifty.h:30: error: syntax error before `{' token
knifty.h:33: error: destructors must be member functions
knifty.h:34: error: virtual outside class declaration
knifty.h:35: error: syntax error before `*' token
knifty.h: In function `bool KNifty::initialized()':
knifty.h:37: error: `m_initialized' undeclared (first use this function)
knifty.h:37: error: (Each undeclared identifier is reported only once for each function it appears in.)
knifty.h: In function `int KNifty::titleHeight()':
knifty.h:39: error: `m_titleHeight' undeclared (first use this function)
knifty.h: In function `int KNifty::titleHeightTool()':
knifty.h:40: error: `m_titleHeightTool' undeclared (first use this function)
knifty.h: In function `QFont KNifty::titleFont()':
knifty.h:41: error: `m_titleFont' undeclared (first use this function)
knifty.h: In function `QFont KNifty::titleFontTool()':
knifty.h:42: error: `m_titleFontTool' undeclared (first use this function)
knifty.h: In function `bool KNifty::titleShadow()':
knifty.h:43: error: `m_titleShadow' undeclared (first use this function)
knifty.h: In function `bool KNifty::shrinkBorders()':
knifty.h:44: error: `m_shrinkBorders' undeclared (first use this function)
knifty.h: In function `int KNifty::borderSize()':
knifty.h:45: error: `m_borderSize' undeclared (first use this function)
knifty.h: In function `bool KNifty::useTitleColor()':
knifty.h:46: error: `m_useTitleColor' undeclared (first use this function)
knifty.h: In function `bool KNifty::useHighContrastHoveredButtons()':
knifty.h:47: error: `m_useHighContrastHoveredButtons' undeclared (first use this function)
knifty.h: In function `bool KNifty::bordersBlendColor()':
knifty.h:48: error: `m_bordersBlendColor' undeclared (first use this function)
knifty.h: In function `Qt::AlignmentFlags KNifty::titleAlign()':
knifty.h:49: error: `m_titleAlign' undeclared (first use this function)
knifty.h: At global scope:
knifty.h:52: error: syntax error before `private'
knifty.h:55: error: `bool KNifty::m_titleShadow' used prior to declaration
knifty.h:56: error: `bool KNifty::m_shrinkBorders' used prior to declaration
knifty.h:57: error: `bool KNifty::m_useTitleColor' used prior to declaration
knifty.h:58: error: `bool KNifty::m_useHighContrastHoveredButtons' used prior to declaration
knifty.h:59: error: `bool KNifty::m_bordersBlendColor' used prior to declaration
knifty.h:60: error: `int KNifty::m_borderSize' used prior to declaration
knifty.h:61: error: `int KNifty::m_titleHeight' used prior to declaration
knifty.h:62: error: `int KNifty::m_titleHeightTool' used prior to declaration
knifty.h:63: error: `QFont KNifty::m_titleFont' used prior to declaration
knifty.h:64: error: `QFont KNifty::m_titleFontTool' used prior to declaration
knifty.h:65: error: `Qt::AlignmentFlags KNifty::m_titleAlign' used prior to declaration
knifty.h:67: error: `bool KNifty::m_initialized' used prior to declaration
knifty.h:72: error: syntax error before `}' token
In file included from knifty.cpp:13:
kniftyclient.h:25: error: syntax error before `{' token
kniftyclient.h:26: error: virtual outside class declaration
kniftyclient.h:26: error: non-member function `const char* className()' cannot have `const' method qualifier
kniftyclient.h:26: error: virtual outside class declaration
kniftyclient.h:26: error: virtual outside class declaration
kniftyclient.h:26: error: virtual outside class declaration
kniftyclient.h:26: error: virtual outside class declaration
kniftyclient.h: In function `QObject* qObject()':
kniftyclient.h:26: error: invalid use of `this' in non-member function
kniftyclient.h: At global scope:
kniftyclient.h:26: error: syntax error before `private'
kniftyclient.h:29: error: destructors must be member functions
kniftyclient.h:31: error: virtual outside class declaration
kniftyclient.h:34: error: non-member function `QPixmap getTitleBarTile(bool)' cannot have `const' method qualifier
kniftyclient.h: In function `QPixmap getTitleBarTile(bool)':
kniftyclient.h:34: error: return type `struct QPixmap' is incomplete
kniftyclient.h:35: error: `aTitleBarTile' undeclared (first use this function)
kniftyclient.h:35: error: `iTitleBarTile' undeclared (first use this function)
kniftyclient.h: At global scope:
kniftyclient.h:37: error: syntax error before `protected'
kniftyclient.h:39: error: virtual outside class declaration
kniftyclient.h:40: error: virtual outside class declaration
kniftyclient.h:41: error: virtual outside class declaration
kniftyclient.h:43: error: virtual outside class declaration
kniftyclient.h:44: error: virtual outside class declaration
kniftyclient.h:44: error: non-member function `void borders(int&, int&, int&, int&)' cannot have `const' method qualifier
kniftyclient.h:45: error: virtual outside class declaration
kniftyclient.h:46: error: virtual outside class declaration
kniftyclient.h:47: error: virtual outside class declaration
kniftyclient.h:48: error: virtual outside class declaration
kniftyclient.h:49: error: virtual outside class declaration
kniftyclient.h:49: error: non-member function `bool isTool()' cannot have `const' method qualifier
kniftyclient.h:51: error: virtual outside class declaration
kniftyclient.h:52: error: virtual outside class declaration
kniftyclient.h:53: error: virtual outside class declaration
kniftyclient.h:54: error: virtual outside class declaration
kniftyclient.h:54: error: non-member function `QSize minimumSize()' cannot have `const' method qualifier
kniftyclient.h:55: error: syntax error before `(' token
kniftyclient.h:61: error: syntax error before `private'
kniftyclient.h:77: error: `QPixmap*aTitleBarTile' used prior to declaration
kniftyclient.h:77: error: `QPixmap*iTitleBarTile' used prior to declaration
kniftyclient.h:82: error: syntax error before `*' token
kniftyclient.h:90: error: syntax error before `}' token
knifty.cpp:20: error: invalid use of undefined type `class KNifty::KniftyHandler'
knifty.h:29: error: forward declaration of `class KNifty::KniftyHandler'
knifty.cpp:20: error: assignment (not initialization) in declaration
knifty.cpp:21: error: invalid use of undefined type `class KNifty::KniftyHandler'
knifty.h:29: error: forward declaration of `class KNifty::KniftyHandler'
knifty.cpp:21: error: assignment (not initialization) in declaration
knifty.cpp:22: error: invalid use of undefined type `class KNifty::KniftyHandler'
knifty.h:29: error: forward declaration of `class KNifty::KniftyHandler'
knifty.cpp:22: error: assignment (not initialization) in declaration
knifty.cpp:23: error: invalid use of undefined type `class KNifty::KniftyHandler'
knifty.h:29: error: forward declaration of `class KNifty::KniftyHandler'
knifty.cpp:23: error: assignment (not initialization) in declaration
knifty.cpp:24: error: invalid use of undefined type `class KNifty::KniftyHandler'
knifty.h:29: error: forward declaration of `class KNifty::KniftyHandler'
knifty.cpp:24: error: assignment (not initialization) in declaration
knifty.cpp:25: error: invalid use of undefined type `class KNifty::KniftyHandler'
knifty.h:29: error: forward declaration of `class KNifty::KniftyHandler'
knifty.cpp:25: error: assignment (not initialization) in declaration
knifty.cpp:26: error: invalid use of undefined type `class KNifty::KniftyHandler'
knifty.h:29: error: forward declaration of `class KNifty::KniftyHandler'
knifty.cpp:26: error: assignment (not initialization) in declaration
knifty.cpp:27: error: invalid use of undefined type `class KNifty::KniftyHandler'
knifty.h:29: error: forward declaration of `class KNifty::KniftyHandler'
knifty.cpp:27: error: assignment (not initialization) in declaration
knifty.cpp:28: error: invalid use of undefined type `class KNifty::KniftyHandler'
knifty.h:29: error: forward declaration of `class KNifty::KniftyHandler'
knifty.cpp:28: error: assignment (not initialization) in declaration
knifty.cpp:29: error: invalid use of undefined type `class KNifty::KniftyHandler'
knifty.h:29: error: forward declaration of `class KNifty::KniftyHandler'
knifty.cpp:29: error: assignment (not initialization) in declaration
knifty.cpp:30: error: invalid use of undefined type `class KNifty::KniftyHandler'
knifty.h:29: error: forward declaration of `class KNifty::KniftyHandler'
knifty.cpp:30: error: assignment (not initialization) in declaration
knifty.cpp:31: error: invalid use of undefined type `class KNifty::KniftyHandler'
knifty.h:29: error: forward declaration of `class KNifty::KniftyHandler'
knifty.cpp:31: error: assignment (not initialization) in declaration
knifty.cpp:34: error: invalid use of undefined type `class KNifty::KniftyHandler'
knifty.h:29: error: forward declaration of `class KNifty::KniftyHandler'
knifty.cpp:39: error: invalid use of undefined type `class KNifty::KniftyHandler'
knifty.h:29: error: forward declaration of `class KNifty::KniftyHandler'
knifty.cpp:43: error: syntax error before `*' token
knifty.cpp:50: error: invalid use of undefined type `class KNifty::KniftyHandler'
knifty.h:29: error: forward declaration of `class KNifty::KniftyHandler'
knifty.cpp: In member function `bool KNifty::KniftyHandler::reset(long unsigned int)':
knifty.cpp:51: error: `options' undeclared (first use this function)
knifty.cpp:58: error: `readConfig' undeclared (first use this function)
knifty.cpp:61: error: `resetDecorations' undeclared (first use this function)
knifty.cpp: At global scope:
knifty.cpp:69: error: invalid use of undefined type `class KNifty::KniftyHandler'
knifty.h:29: error: forward declaration of `class KNifty::KniftyHandler'
knifty.cpp: In member function `bool KNifty::KniftyHandler::readConfig()':
knifty.cpp:77: error: `KDecoration' undeclared (first use this function)
knifty.cpp:77: error: syntax error before `::' token
knifty.cpp:81: error: `BorderLarge' undeclared (first use this function)
knifty.cpp:81: error: case label `' not within a switch statement
knifty.cpp:84: error: `BorderVeryLarge' undeclared (first use this function)
knifty.cpp:84: error: case label `' not within a switch statement
knifty.cpp:87: error: `BorderHuge' undeclared (first use this function)
knifty.cpp:87: error: case label `' not within a switch statement
knifty.cpp:90: error: `BorderVeryHuge' undeclared (first use this function)
knifty.cpp:90: error: case label `' not within a switch statement
knifty.cpp:93: error: `BorderOversized' undeclared (first use this function)
knifty.cpp:93: error: case label `' not within a switch statement
knifty.cpp:96: error: `BorderNormal' undeclared (first use this function)
knifty.cpp:96: error: case label `' not within a switch statement
knifty.cpp:97: error: `default' label not within a switch statement
knifty.cpp: At global scope:
knifty.cpp:104: error: ISO C++ forbids declaration of `m_titleHeight' with no type
knifty.cpp:106: error: ISO C++ forbids declaration of `fm' with no type
knifty.cpp:106: error: conflicting types for `int fm'
knifty.cpp:101: error: previous declaration as `QFontMetrics fm'
knifty.cpp:109: error: ISO C++ forbids declaration of `m_titleHeightTool' with no type
knifty.cpp:109: error: request for member `height' in `fm', which is of non-aggregate type `int'
knifty.cpp:109: error: request for member `height' in `fm', which is of non-aggregate type `int'
knifty.cpp:111: error: `config' was not declared in this scope
knifty.cpp:112: error: syntax error before `if'
knifty.cpp:116: error: ISO C++ forbids declaration of `m_useHighContrastHoveredButtons' with no type
knifty.cpp:116: error: `config' was not declared in this scope
knifty.cpp:117: error: ISO C++ forbids declaration of `m_useTitleColor' with no type
knifty.cpp:117: error: `config' was not declared in this scope
knifty.cpp:118: error: ISO C++ forbids declaration of `m_bordersBlendColor' with no type
knifty.cpp:118: error: `config' was not declared in this scope
knifty.cpp:120: error: syntax error before `return'
knifty.cpp:127: error: syntax error before `*' token
knifty.cpp:131: error: syntax error before `*' token
kniftyclient.h:26: warning: `bool qt_static_property(QObject*, int, int, QVariant*)' declared `static' but never defined
kniftyclient.h:26: warning: `QMetaObject* staticMetaObject()' declared `static' but never defined
kniftyclient.h:26: warning: `QString tr(const char*, const char*)' declared `static' but never defined
kniftyclient.h:26: warning: `QString trUtf8(const char*, const char*)' declared `static' but never defined
knifty.h:37: warning: `bool KNifty::initialized()' defined but not used
knifty.h:39: warning: `int KNifty::titleHeight()' defined but not used
knifty.h:40: warning: `int KNifty::titleHeightTool()' defined but not used
knifty.h:41: warning: `QFont KNifty::titleFont()' defined but not used
knifty.h:42: warning: `QFont KNifty::titleFontTool()' defined but not used
knifty.h:43: warning: `bool KNifty::titleShadow()' defined but not used
knifty.h:44: warning: `bool KNifty::shrinkBorders()' defined but not used
knifty.h:45: warning: `int KNifty::borderSize()' defined but not used
knifty.h:46: warning: `bool KNifty::useTitleColor()' defined but not used
knifty.h:47: warning: `bool KNifty::useHighContrastHoveredButtons()' defined but not used
knifty.h:48: warning: `bool KNifty::bordersBlendColor()' defined but not used
knifty.h:49: warning: `Qt::AlignmentFlags KNifty::titleAlign()' defined but not used
knifty.h:57: warning: `bool KNifty::m_useTitleColor' defined but not used
knifty.h:58: warning: `bool KNifty::m_useHighContrastHoveredButtons' defined but not used
knifty.h:59: warning: `bool KNifty::m_bordersBlendColor' defined but not used
knifty.h:61: warning: `int KNifty::m_titleHeight' defined but not used
knifty.h:62: warning: `int KNifty::m_titleHeightTool' defined but not used
knifty.h:65: warning: `Qt::AlignmentFlags KNifty::m_titleAlign' defined but not used
make[3]: *** [knifty.lo] Error 1
make[3]: Leaving directory `/home/albator/Download/8841-knifty-0.4.0/knifty-0.4.0/client'
make[2]: *** [all-recursive] Error 1
make[2]: Leaving directory `/home/albator/Download/8841-knifty-0.4.0/knifty-0.4.0/client'
make[1]: *** [all-recursive] Error 1
make[1]: Leaving directory `/home/albator/Download/8841-knifty-0.4.0/knifty-0.4.0'
make: *** [all] Error 2

Can u help me plz,

regards, Savagearth. - Nov 10 2003