Image 01
profile-image

sandsnake

Vladislav Zitikis Saint Petersburg, Russian Federation
google translate runner

Web Runners by jgoday 17 comments

I simply commented this line. Compilation and installation finished without errors. But I can't find this applet in plasma widgets listing. Don't know why :(
Ok, I think better I wait update to kde 4.3. But now I want say - thank you!! This applet is very interested for me. - Jun 08 2009
google translate runner

Web Runners by jgoday 17 comments

May be you can help me?

[vlad@vixen googletranslate]$ cmake CMakeLists.txt
-- The C compiler identification is GNU
-- The CXX compiler identification is GNU
-- Check for working C compiler: /usr/bin/gcc
-- Check for working C compiler: /usr/bin/gcc -- works
-- Detecting C compiler ABI info
-- Detecting C compiler ABI info - done
-- Check for working CXX compiler: /usr/bin/c++
-- Check for working CXX compiler: /usr/bin/c++ -- works
-- Detecting CXX compiler ABI info
-- Detecting CXX compiler ABI info - done
-- Looking for Q_WS_X11
-- Looking for Q_WS_X11 - found
-- Looking for Q_WS_WIN
-- Looking for Q_WS_WIN - not found.
-- Looking for Q_WS_QWS
-- Looking for Q_WS_QWS - not found.
-- Looking for Q_WS_MAC
-- Looking for Q_WS_MAC - not found.
-- Found Qt-Version 4.5.1 (using /usr/bin/qmake)
-- Looking for XOpenDisplay in /usr/lib/libX11.so;/usr/lib/libXext.so;/usr/lib/libXft.so;/usr/lib/libXau.so;/usr/lib/libXdmcp.so;/usr/lib/libXpm.so
-- Looking for XOpenDisplay in /usr/lib/libX11.so;/usr/lib/libXext.so;/usr/lib/libXft.so;/usr/lib/libXau.so;/usr/lib/libXdmcp.so;/usr/lib/libXpm.so - found
-- Looking for gethostbyname
-- Looking for gethostbyname - found
-- Looking for connect
-- Looking for connect - found
-- Looking for remove
-- Looking for remove - found
-- Looking for shmat
-- Looking for shmat - found
-- Looking for IceConnectionNumber in ICE
-- Looking for IceConnectionNumber in ICE - found
-- Found X11: /usr/lib/libX11.so
-- Looking for include files CMAKE_HAVE_PTHREAD_H
-- Looking for include files CMAKE_HAVE_PTHREAD_H - found
-- Looking for pthread_create in pthreads
-- Looking for pthread_create in pthreads - not found
-- Looking for pthread_create in pthread
-- Looking for pthread_create in pthread - found
-- Found Threads: TRUE
-- Found Automoc4: /usr/bin/automoc4
-- Found Perl: /usr/bin/perl
-- Performing Test _OFFT_IS_64BIT
-- Performing Test _OFFT_IS_64BIT - Failed
-- Performing Test HAVE_FPIE_SUPPORT
-- Performing Test HAVE_FPIE_SUPPORT - Success
-- Performing Test __KDE_HAVE_W_OVERLOADED_VIRTUAL
-- Performing Test __KDE_HAVE_W_OVERLOADED_VIRTUAL - Success
-- Performing Test __KDE_HAVE_GCC_VISIBILITY
-- Performing Test __KDE_HAVE_GCC_VISIBILITY - Success
-- Phonon Version: 4.3.0
-- Found Phonon: /usr/lib/libphonon.so
-- Found Phonon Includes: /usr/include/KDE;/usr/include
-- Found KDE 4.2 include dir: /usr/include
-- Found KDE 4.2 library dir: /usr/lib
-- Found the KDE4 kconfig_compiler preprocessor: /usr/bin/kconfig_compiler
-- Found automoc4: /usr/bin/automoc4
-- Found KDE4Workspace: /usr/lib/cmake/KDE4Workspace-4.2.4/KDE4WorkspaceConfig.cmake
-- Found KdepimLibs: /usr/lib/cmake/KdepimLibs-4.2.4/KdepimLibsConfig.cmake
-- Configuring done
-- Generating done
-- Build files have been written to: /home/vlad/googletranslate

[vlad@vixen googletranslate]$ make
[ 0%] Built target krunner_googletranslate_automoc
[ 25%] Building CXX object CMakeFiles/krunner_googletranslate.dir/googletranslate.o
/home/vlad/googletranslate/googletranslate.cpp: In constructor 'GoogleTranslateRunner::GoogleTranslateRunner(QObject*, const QVariantList&)':
/home/vlad/googletranslate/googletranslate.cpp:43: error: 'RunnerSyntax' is not a member of 'Plasma'
/home/vlad/googletranslate/googletranslate.cpp:43: error: 'addSyntax' was not declared in this scope
make[2]: *** [CMakeFiles/krunner_googletranslate.dir/googletranslate.o] Error 1
make[1]: *** [CMakeFiles/krunner_googletranslate.dir/all] Error 2
make: *** [all] Error 2 - Jun 07 2009
6 .3
Jun 08 2009