Image 01
profile-image

ruf

Sourish Basu
QtCurve Mock-OSX

QtCurve by donpedro69 4 comments

For some reason the download link is down. When I click on the link, I get an error "filemtime(): stat failed for /mnt/s3/ppload/data/files/1460745717/162040-MockOSX-1.qtcurve". Is there another way to get this config? Thanks! - Jul 06 2016
kate tabbar plugin

Text Editors by jgoday 15 comments

When I try to compile (using the following steps):

mkdir build
cd build
cmake -DCMAKE_INSTALL_PREFIX=`kde-config --prefix` ..
make

I get the following error:

Downloads/katetabbar/katetabsplugin.h:31: Error: Undefined interface
automoc4: process for /home/i/Downloads/katetabbar/build/moc_katetabsplugin.cpp failed: Unknown error
pid to wait for: 0
returning failed..
make[2]: *** [CMakeFiles/katetabsplugin_automoc] Error 1
make[1]: *** [CMakeFiles/katetabsplugin_automoc.dir/all] Error 2
make: *** [all] Error 2

?? - Mar 30 2010