Image 01
profile-image

nishantjr

Nishant Rodrigues mumbai, India
Bespin

Be-Shell/Bespin by thomas12777 1663 comments

That would be cool too... I dislike menubars in general... but u need em sometimes - Aug 31 2010
Bespin

Be-Shell/Bespin by thomas12777 1663 comments

Would it be possible to put menu bars into the title bars similar to the windows iTunes? - Aug 30 2010
Smooth Tasks

Plasma 4 Extensions by panzi 842 comments

It would be really cool if you could implement dwm-style task grouping,
Eg: 1 group for chat, 1 for browsing, 1 for devel etc, it would go really well with the new kwin tiling feature - Jun 20 2010
Bespin

Be-Shell/Bespin by thomas12777 1663 comments

OK, Its just that i find konsole/dolphin/kopete tabbing really ugly and somewhat inconstistant, and dislike haveing 2 windows of the same app opened - Jun 18 2010
Bespin

Be-Shell/Bespin by thomas12777 1663 comments

Any plans to include tabs? - Jun 16 2010
plasma-am3rok

Plasma 4 Extensions by iovar 57 comments

Same prob here....
Got the src from yaourt ...
Edited the cmake file as required...

got this....

[ 28%] Building CXX object CMakeFiles/plasma_applet_am3rok.dir/amarok_client.o
/tmp/yaourt-tmp-nishant/aur-plasma-am3rok-plasmoid/plasma-am3rok-plasmoid/src/plasma-am3rok-0.4.1/amarok_client.cpp: In member function ‘virtual void AmarokClient::mousePressEvent(QGraphicsSceneMouseEvent*)’:
/tmp/yaourt-tmp-nishant/aur-plasma-am3rok-plasmoid/plasma-am3rok-plasmoid/src/plasma-am3rok-0.4.1/amarok_client.cpp:265: error: ‘class InfoDialog’ has no member named ‘position’
make[2]: *** [CMakeFiles/plasma_applet_am3rok.dir/amarok_client.o] Error 1
make[1]: *** [CMakeFiles/plasma_applet_am3rok.dir/all] Error 2
make: *** [all] Error 2
==> ERROR: Build Failed.
Aborting...
Error: Makepkg was unable to build plasma-am3rok-plasmoid package.


went crazy and commented out the problem line from the source(forgive my if that was stupid and bound not to work, am a noob in open source)

and it gave me this:

[ 28%] Building CXX object CMakeFiles/plasma_applet_am3rok.dir/buttonwidget.o
/tmp/yaourt-tmp-nishant/aur-plasma-am3rok-plasmoid/plasma-am3rok-plasmoid/src/plasma-am3rok-0.4.1/buttonwidget.cpp:29:33: error: plasma/widgets/icon.h: No such file or directory
/tmp/yaourt-tmp-nishant/aur-plasma-am3rok-plasmoid/plasma-am3rok-plasmoid/src/plasma-am3rok-0.4.1/buttonwidget.cpp: In constructor ‘ButtonWidget::ButtonWidget(QGraphicsWidget*)’:
/tmp/yaourt-tmp-nishant/aur-plasma-am3rok-plasmoid/plasma-am3rok-plasmoid/src/plasma-am3rok-0.4.1/buttonwidget.cpp:45: error: invalid use of incomplete type ‘struct Plasma::Icon’
/tmp/yaourt-tmp-nishant/aur-plasma-am3rok-plasmoid/plasma-am3rok-plasmoid/src/plasma-am3rok-0.4.1/buttonwidget.hpp:33: error: forward declaration of ‘struct Plasma::Icon’
/tmp/yaourt-tmp-nishant/aur-plasma-am3rok-plasmoid/plasma-am3rok-plasmoid/src/plasma-am3rok-0.4.1/buttonwidget.cpp:46: error: invalid use of incomplete type ‘struct Plasma::Icon’
/tmp/yaourt-tmp-nishant/aur-plasma-am3rok-plasmoid/plasma-am3rok-plasmoid/src/plasma-am3rok-0.4.1/buttonwidget.hpp:33: error: forward declaration of ‘struct Plasma::Icon’
/tmp/yaourt-tmp-nishant/aur-plasma-am3rok-plasmoid/plasma-am3rok-plasmoid/src/plasma-am3rok-0.4.1/buttonwidget.cpp:47: error: invalid use of incomplete type ‘struct Plasma::Icon’
/tmp/yaourt-tmp-nishant/aur-plasma-am3rok-plasmoid/plasma-am3rok-plasmoid/src/plasma-am3rok-0.4.1/buttonwidget.hpp:33: error: forward declaration of ‘struct Plasma::Icon’
/tmp/yaourt-tmp-nishant/aur-plasma-am3rok-plasmoid/plasma-am3rok-plasmoid/src/plasma-am3rok-0.4.1/buttonwidget.cpp:48: error: invalid use of incomplete type ‘struct Plasma::Icon’
/tmp/yaourt-tmp-nishant/aur-plasma-am3rok-plasmoid/plasma-am3rok-plasmoid/src/plasma-am3rok-0.4.1/buttonwidget.hpp:33: error: forward declaration of ‘struct Plasma::Icon’
/tmp/yaourt-tmp-nishant/aur-plasma-am3rok-plasmoid/plasma-am3rok-plasmoid/src/plasma-am3rok-0.4.1/buttonwidget.cpp:50: error: no matching function for call to ‘QGraphicsLinearLayout::addItem(Plasma::Icon*&)’
/usr/include/QtGui/qgraphicslinearlayout.h:66: note: candidates are: void QGraphicsLinearLayout::addItem(QGraphicsLayoutItem*)
/tmp/yaourt-tmp-nishant/aur-plasma-am3rok-plasmoid/plasma-am3rok-plasmoid/src/plasma-am3rok-0.4.1/buttonwidget.cpp:51: error: no matching function for call to ‘QGraphicsLinearLayout::addItem(Plasma::Icon*&)’
/usr/include/QtGui/qgraphicslinearlayout.h:66: note: candidates are: void QGraphicsLinearLayout::addItem(QGraphicsLayoutItem*)
/tmp/yaourt-tmp-nishant/aur-plasma-am3rok-plasmoid/plasma-am3rok-plasmoid/src/plasma-am3rok-0.4.1/buttonwidget.cpp:52: error: no matching function for call to ‘QGraphicsLinearLayout::addItem(Plasma::Icon*&)’
/usr/include/QtGui/qgraphicslinearlayout.h:66: note: candidates are: void QGraphicsLinearLayout::addItem(QGraphicsLayoutItem*)
/tmp/yaourt-tmp-nishant/aur-plasma-am3rok-plasmoid/plasma-am3rok-plasmoid/src/plasma-am3rok-0.4.1/buttonwidget.cpp:53: error: no matching function for call to ‘QGraphicsLinearLayout::addItem(Plasma::Icon*&)’
/usr/include/QtGui/qgraphicslinearlayout.h:66: note: candidates are: void QGraphicsLinearLayout::addItem(QGraphicsLayoutItem*)
/tmp/yaourt-tmp-nishant/aur-plasma-am3rok-plasmoid/plasma-am3rok-plasmoid/src/plasma-am3rok-0.4.1/buttonwidget.cpp:57: error: no matching function for call to ‘ButtonWidget::connect(Plasma::Icon*&, const char [11], ButtonWidget* const, const char [15])’
/usr/include/QtCore/qobject.h:197: note: candidates are: static bool QObject::connect(const QObject*, const char*, const QObject*, const char*, Qt::ConnectionType)
/usr/include/QtCore/qobject.h:302: note: bool QObject::connect(const QObject*, const char*, const char*, Qt::ConnectionType) const
/tmp/yaourt-tmp-nishant/aur-plasma-am3rok-plasmoid/plasma-am3rok-plasmoid/src/plasma-am3rok-0.4.1/buttonwidget.cpp:59: error: no matching function for call to ‘ButtonWidget::connect(Plasma::Icon*&, const char [11], ButtonWidget* const, const char [15])’
/usr/include/QtCore/qobject.h:197: note: candidates are: static bool QObject::connect(const QObject*, const char*, const QObject*, const char*, Qt::ConnectionType)
/usr/include/QtCore/qobject.h:302: note: bool QObject::connect(const QObject*, const char*, const char*, Qt::ConnectionType) const
/tmp/yaourt-tmp-nishant/aur-plasma-am3rok-plasmoid/plasma-am3rok-plasmoid/src/plasma-am3rok-0.4.1/buttonwidget.cpp:61: error: no matching function for call to ‘ButtonWidget::connect(Plasma::Icon*&, const char [11], ButtonWidget* const, const char [15])’
/usr/include/QtCore/qobject.h:197: note: candidates are: static bool QObject::connect(const QObject*, const char*, const QObject*, const char*, Qt::ConnectionType)
/usr/include/QtCore/qobject.h:302: note: bool QObject::connect(const QObject*, const char*, const char*, Qt::ConnectionType) const
/tmp/yaourt-tmp-nishant/aur-plasma-am3rok-plasmoid/plasma-am3rok-plasmoid/src/plasma-am3rok-0.4.1/buttonwidget.cpp:63: error: no matching function for call to ‘ButtonWidget::connect(Plasma::Icon*&, const char [11], ButtonWidget* const, const char [15])’
/usr/include/QtCore/qobject.h:197: note: candidates are: static bool QObject::connect(const QObject*, const char*, const QObject*, const char*, Qt::ConnectionType)
/usr/include/QtCore/qobject.h:302: note: bool QObject::connect(const QObject*, const char*, const char*, Qt::ConnectionType) const
/tmp/yaourt-tmp-nishant/aur-plasma-am3rok-plasmoid/plasma-am3rok-plasmoid/src/plasma-am3rok-0.4.1/buttonwidget.cpp: In destructor ‘virtual ButtonWidget::~ButtonWidget()’:
/tmp/yaourt-tmp-nishant/aur-plasma-am3rok-plasmoid/plasma-am3rok-plasmoid/src/plasma-am3rok-0.4.1/buttonwidget.cpp:72: warning: possible problem detected in invocation of delete operator:
/tmp/yaourt-tmp-nishant/aur-plasma-am3rok-plasmoid/plasma-am3rok-plasmoid/src/plasma-am3rok-0.4.1/buttonwidget.cpp:72: warning: invalid use of incomplete type ‘struct Plasma::Icon’
/tmp/yaourt-tmp-nishant/aur-plasma-am3rok-plasmoid/plasma-am3rok-plasmoid/src/plasma-am3rok-0.4.1/buttonwidget.hpp:33: warning: forward declaration of ‘struct Plasma::Icon’
/tmp/yaourt-tmp-nishant/aur-plasma-am3rok-plasmoid/plasma-am3rok-plasmoid/src/plasma-am3rok-0.4.1/buttonwidget.cpp:72: note: neither the destructor nor the class-specific operator delete will be called, even if they are declared when the class is defined.
/tmp/yaourt-tmp-nishant/aur-plasma-am3rok-plasmoid/plasma-am3rok-plasmoid/src/plasma-am3rok-0.4.1/buttonwidget.cpp:73: warning: possible problem detected in invocation of delete operator:
/tmp/yaourt-tmp-nishant/aur-plasma-am3rok-plasmoid/plasma-am3rok-plasmoid/src/plasma-am3rok-0.4.1/buttonwidget.cpp:73: warning: invalid use of incomplete type ‘struct Plasma::Icon’
/tmp/yaourt-tmp-nishant/aur-plasma-am3rok-plasmoid/plasma-am3rok-plasmoid/src/plasma-am3rok-0.4.1/buttonwidget.hpp:33: warning: forward declaration of ‘struct Plasma::Icon’
/tmp/yaourt-tmp-nishant/aur-plasma-am3rok-plasmoid/plasma-am3rok-plasmoid/src/plasma-am3rok-0.4.1/buttonwidget.cpp:73: note: neither the destructor nor the class-specific operator delete will be called, even if they are declared when the class is defined.
/tmp/yaourt-tmp-nishant/aur-plasma-am3rok-plasmoid/plasma-am3rok-plasmoid/src/plasma-am3rok-0.4.1/buttonwidget.cpp:74: warning: possible problem detected in invocation of delete operator:
/tmp/yaourt-tmp-nishant/aur-plasma-am3rok-plasmoid/plasma-am3rok-plasmoid/src/plasma-am3rok-0.4.1/buttonwidget.cpp:74: warning: invalid use of incomplete type ‘struct Plasma::Icon’
/tmp/yaourt-tmp-nishant/aur-plasma-am3rok-plasmoid/plasma-am3rok-plasmoid/src/plasma-am3rok-0.4.1/buttonwidget.hpp:33: warning: forward declaration of ‘struct Plasma::Icon’
/tmp/yaourt-tmp-nishant/aur-plasma-am3rok-plasmoid/plasma-am3rok-plasmoid/src/plasma-am3rok-0.4.1/buttonwidget.cpp:74: note: neither the destructor nor the class-specific operator delete will be called, even if they are declared when the class is defined.
/tmp/yaourt-tmp-nishant/aur-plasma-am3rok-plasmoid/plasma-am3rok-plasmoid/src/plasma-am3rok-0.4.1/buttonwidget.cpp:75: warning: possible problem detected in invocation of delete operator:
/tmp/yaourt-tmp-nishant/aur-plasma-am3rok-plasmoid/plasma-am3rok-plasmoid/src/plasma-am3rok-0.4.1/buttonwidget.cpp:75: warning: invalid use of incomplete type ‘struct Plasma::Icon’
/tmp/yaourt-tmp-nishant/aur-plasma-am3rok-plasmoid/plasma-am3rok-plasmoid/src/plasma-am3rok-0.4.1/buttonwidget.hpp:33: warning: forward declaration of ‘struct Plasma::Icon’
/tmp/yaourt-tmp-nishant/aur-plasma-am3rok-plasmoid/plasma-am3rok-plasmoid/src/plasma-am3rok-0.4.1/buttonwidget.cpp:75: note: neither the destructor nor the class-specific operator delete will be called, even if they are declared when the class is defined.
/tmp/yaourt-tmp-nishant/aur-plasma-am3rok-plasmoid/plasma-am3rok-plasmoid/src/plasma-am3rok-0.4.1/buttonwidget.cpp: In member function ‘void ButtonWidget::setStatus(const QString&)’:
/tmp/yaourt-tmp-nishant/aur-plasma-am3rok-plasmoid/plasma-am3rok-plasmoid/src/plasma-am3rok-0.4.1/buttonwidget.cpp:109: error: invalid use of incomplete type ‘struct Plasma::Icon’
/tmp/yaourt-tmp-nishant/aur-plasma-am3rok-plasmoid/plasma-am3rok-plasmoid/src/plasma-am3rok-0.4.1/buttonwidget.hpp:33: error: forward declaration of ‘struct Plasma::Icon’
/tmp/yaourt-tmp-nishant/aur-plasma-am3rok-plasmoid/plasma-am3rok-plasmoid/src/plasma-am3rok-0.4.1/buttonwidget.cpp:111: error: invalid use of incomplete type ‘struct Plasma::Icon’
/tmp/yaourt-tmp-nishant/aur-plasma-am3rok-plasmoid/plasma-am3rok-plasmoid/src/plasma-am3rok-0.4.1/buttonwidget.hpp:33: error: forward declaration of ‘struct Plasma::Icon’
/tmp/yaourt-tmp-nishant/aur-plasma-am3rok-plasmoid/plasma-am3rok-plasmoid/src/plasma-am3rok-0.4.1/buttonwidget.cpp:112: error: invalid use of incomplete type ‘struct Plasma::Icon’
/tmp/yaourt-tmp-nishant/aur-plasma-am3rok-plasmoid/plasma-am3rok-plasmoid/src/plasma-am3rok-0.4.1/buttonwidget.hpp:33: error: forward declaration of ‘struct Plasma::Icon’
/tmp/yaourt-tmp-nishant/aur-plasma-am3rok-plasmoid/plasma-am3rok-plasmoid/src/plasma-am3rok-0.4.1/buttonwidget.cpp: In member function ‘void ButtonWidget::buttonEnable(Plasma::Icon*, bool)’:
/tmp/yaourt-tmp-nishant/aur-plasma-am3rok-plasmoid/plasma-am3rok-plasmoid/src/plasma-am3rok-0.4.1/buttonwidget.cpp:130: error: invalid use of incomplete type ‘struct Plasma::Icon’
/tmp/yaourt-tmp-nishant/aur-plasma-am3rok-plasmoid/plasma-am3rok-plasmoid/src/plasma-am3rok-0.4.1/buttonwidget.hpp:33: error: forward declaration of ‘struct Plasma::Icon’
/tmp/yaourt-tmp-nishant/aur-plasma-am3rok-plasmoid/plasma-am3rok-plasmoid/src/plasma-am3rok-0.4.1/buttonwidget.cpp:131: error: invalid use of incomplete type ‘struct Plasma::Icon’
/tmp/yaourt-tmp-nishant/aur-plasma-am3rok-plasmoid/plasma-am3rok-plasmoid/src/plasma-am3rok-0.4.1/buttonwidget.hpp:33: error: forward declaration of ‘struct Plasma::Icon’
/tmp/yaourt-tmp-nishant/aur-plasma-am3rok-plasmoid/plasma-am3rok-plasmoid/src/plasma-am3rok-0.4.1/buttonwidget.cpp:132: error: invalid use of incomplete type ‘struct Plasma::Icon’
/tmp/yaourt-tmp-nishant/aur-plasma-am3rok-plasmoid/plasma-am3rok-plasmoid/src/plasma-am3rok-0.4.1/buttonwidget.hpp:33: error: forward declaration of ‘struct Plasma::Icon’
make[2]: *** [CMakeFiles/plasma_applet_am3rok.dir/buttonwidget.o] Error 1
make[1]: *** [CMakeFiles/plasma_applet_am3rok.dir/all] Error 2
make: *** [all] Error 2
==> ERROR: Build Failed. - Feb 18 2009
google-clone

Amarok 2.x Scripts
by jenifferhomes

5 .7
9   Mar 19 2011
Spectrum

KDE 4 Splashscreens
by homebaze

7 .8
9   Dec 25 2010