Image 01
profile-image

netfranz

Francesco Suzzi
KDE Plasma Screenshots
KDE 3.x Splash Screens
Icon Sub-Sets
Various KDE 1.-4. Improvements
Various Stuff
KDE 3.5 Themes
Single Icon/Logo
Various KDE 1.-4. Styles
Wallpaper Other
test
VC-Dark

Beryl/Emerald Themes 9 comments

by VemeC
Score 50.0%
Dec 06 2006
If you used qtcurve as your widget style, can you tell me the color of your menubar? - Dec 06 2006
Kanotix beryl 0.13

KDE Plasma Screenshots 1 comment

Score 50.0%
Nov 29 2006
How did you do to have the back of the windows visible in the transparent cube? Mine are plain black... :( - Nov 29 2006
i love beryl

KDE Plasma Screenshots 8 comments

by murxl
Score 50.0%
Nov 24 2006
I noticed that the back of your windows show their content inside the cube, mine are plain black... how did you achieved that? - Nov 27 2006
Kompare

Developers Apps 7 comments

by je4d
Score 50.0%
May 26 2005
the software is great as long as u use it with english-only files

Using kompare to apply changes to any utf-8 file will scramble all non-english characters in it! - May 17 2006
Xgl and Compiz on KDE

KDE Plasma Screenshots 8 comments

Score 50.0%
Mar 29 2006
It's rock solid... after I removed a couple of kde applets like kpager2 and mtaskbar all worked smooth, not like kompmgr which was unstable and hungry on memory - Mar 29 2006
I currently use all of the basic plugins: wobbly fade scale rotate etc with no problem - Mar 29 2006
It's not so difficult... I simply followed the OpenSuse tutorial, the onlyu differences are the use of an older compiz package (since 0.0.6 has dependency problems on suse 10) and a custom shell script to launch compiz and gnome decorator at kde startup - Mar 29 2006
Compact menu extension for KDE (Idea)

Various KDE 1.-4. Improvements 4 comments

Score 50.0%
Nov 16 2005
I admit the screenshot could be quite confusing; the button represnting the menu (the "fish" in the screenshot) would be placed alongside the othe buttons in the navigation bar (back, forward, print, etc), so there will be no need for a separate menu bar - Nov 17 2005
The picture is just a Firefox screenshot, so it's far less pretty than an average KDE app :P
I'm using KDE 3.5 rc1 and when I add a Macos like menu its items appear on the rightmost part of the screen and I'm not able to move them...
By the way, I had this idea since I don't like mac os menu very much (I prefer to have the taskbar at the top of the screen) - Nov 16 2005
My desktop

KDE Plasma Screenshots 3 comments

Score 50.0%
Nov 03 2005
Can anyone provide a Suse 10 RPM of patched baghira? Thanx!! - Nov 03 2005
Polymer SuSE RPM

KDE 3.5 Themes 4 comments

by patch
Score 50.0%
Oct 14 2005
Too bad it doesn't work with KDE 3.5 Beta 2 - Oct 28 2005
Polyester

KDE 3.5 Themes 395 comments

by mart
Score 50.0%
Feb 17 2009
Super Suse 10 - kde 3.5 beta

polymerconfig.cc:25:26: error: configdialog.h: No such file or directory
polymerconfig.cc:188:29: error: polymerconfig.moc: No such file or directory
polymerconfig.cc: In constructor ‘polymerConfig::polymerConfig(KConfig*, QWidget*)’:
polymerconfig.cc:39: error: invalid use of undefined type ‘struct ConfigDialog’
polymerconfig.h:36: error: forward declaration of ‘struct ConfigDialog’
polymerconfig.cc:40: error: invalid use of undefined type ‘struct ConfigDialog’
polymerconfig.h:36: error: forward declaration of ‘struct ConfigDialog’
polymerconfig.cc:46: error: invalid use of undefined type ‘struct ConfigDialog’
polymerconfig.h:36: error: forward declaration of ‘struct ConfigDialog’
polymerconfig.cc:48: error: invalid use of undefined type ‘struct ConfigDialog’
polymerconfig.h:36: error: forward declaration of ‘struct ConfigDialog’
polymerconfig.cc:50: error: invalid use of undefined type ‘struct ConfigDialog’
polymerconfig.h:36: error: forward declaration of ‘struct ConfigDialog’
polymerconfig.cc:52: error: invalid use of undefined type ‘struct ConfigDialog’
polymerconfig.h:36: error: forward declaration of ‘struct ConfigDialog’
polymerconfig.cc:53: error: invalid use of undefined type ‘struct ConfigDialog’
polymerconfig.h:36: error: forward declaration of ‘struct ConfigDialog’
polymerconfig.cc:54: error: invalid use of undefined type ‘struct ConfigDialog’
polymerconfig.h:36: error: forward declaration of ‘struct ConfigDialog’
polymerconfig.cc:56: error: invalid use of undefined type ‘struct ConfigDialog’
polymerconfig.h:36: error: forward declaration of ‘struct ConfigDialog’
polymerconfig.cc:57: error: invalid use of undefined type ‘struct ConfigDialog’
polymerconfig.h:36: error: forward declaration of ‘struct ConfigDialog’
polymerconfig.cc:58: error: invalid use of undefined type ‘struct ConfigDialog’
polymerconfig.h:36: error: forward declaration of ‘struct ConfigDialog’
polymerconfig.cc:60: error: invalid use of undefined type ‘struct ConfigDialog’
polymerconfig.h:36: error: forward declaration of ‘struct ConfigDialog’
polymerconfig.cc: At global scope:
polymerconfig.cc:32: warning: unused parameter ‘config’
polymerconfig.cc:32: warning: unused parameter ‘config’
polymerconfig.cc: In destructor ‘virtual polymerConfig::~polymerConfig()’:
polymerconfig.cc:71: warning: possible problem detected in invocation of delete operator:
polymerconfig.cc:71: warning: invalid use of undefined type ‘struct ConfigDialog’
polymerconfig.h:36: warning: forward declaration of ‘struct ConfigDialog’
polymerconfig.cc:71: note: neither the destructor nor the class-specific operator delete will be called, even if they are declared when the class is defined.
polymerconfig.cc: In member function ‘void polymerConfig::selectionChanged(int)’:
polymerconfig.cc:86: error: invalid use of undefined type ‘struct ConfigDialog’
polymerconfig.h:36: error: forward declaration of ‘struct ConfigDialog’
polymerconfig.cc:86: error: invalid use of undefined type ‘struct ConfigDialog’
polymerconfig.h:36: error: forward declaration of ‘struct ConfigDialog’
polymerconfig.cc:86: error: invalid use of undefined type ‘struct ConfigDialog’
polymerconfig.h:36: error: forward declaration of ‘struct ConfigDialog’
polymerconfig.cc:88: error: invalid use of undefined type ‘struct ConfigDialog’
polymerconfig.h:36: error: forward declaration of ‘struct ConfigDialog’
polymerconfig.cc:88: error: invalid use of undefined type ‘struct ConfigDialog’
polymerconfig.h:36: error: forward declaration of ‘struct ConfigDialog’
polymerconfig.cc:88: error: invalid use of undefined type ‘struct ConfigDialog’
polymerconfig.h:36: error: forward declaration of ‘struct ConfigDialog’
polymerconfig.cc:91: error: invalid use of undefined type ‘struct ConfigDialog’
polymerconfig.h:36: error: forward declaration of ‘struct ConfigDialog’
polymerconfig.cc:93: error: invalid use of undefined type ‘struct ConfigDialog’
polymerconfig.h:36: error: forward declaration of ‘struct ConfigDialog’
polymerconfig.cc: In member function ‘void polymerConfig::load(KConfig*)’:
polymerconfig.cc:107: error: invalid use of undefined type ‘struct ConfigDialog’
polymerconfig.h:36: error: forward declaration of ‘struct ConfigDialog’
polymerconfig.cc:113: error: invalid use of undefined type ‘struct ConfigDialog’
polymerconfig.h:36: error: forward declaration of ‘struct ConfigDialog’
polymerconfig.cc:114: error: invalid use of undefined type ‘struct ConfigDialog’
polymerconfig.h:36: error: forward declaration of ‘struct ConfigDialog’
polymerconfig.cc:115: error: invalid use of undefined type ‘struct ConfigDialog’
polymerconfig.h:36: error: forward declaration of ‘struct ConfigDialog’
polymerconfig.cc:118: error: invalid use of undefined type ‘struct ConfigDialog’
polymerconfig.h:36: error: forward declaration of ‘struct ConfigDialog’
polymerconfig.cc:120: error: invalid use of undefined type ‘struct ConfigDialog’
polymerconfig.h:36: error: forward declaration of ‘struct ConfigDialog’
polymerconfig.cc:122: error: invalid use of undefined type ‘struct ConfigDialog’
polymerconfig.h:36: error: forward declaration of ‘struct ConfigDialog’
polymerconfig.cc:124: error: invalid use of undefined type ‘struct ConfigDialog’
polymerconfig.h:36: error: forward declaration of ‘struct ConfigDialog’
polymerconfig.cc:125: error: invalid use of undefined type ‘struct ConfigDialog’
polymerconfig.h:36: error: forward declaration of ‘struct ConfigDialog’
polymerconfig.cc:127: error: invalid use of undefined type ‘struct ConfigDialog’
polymerconfig.h:36: error: forward declaration of ‘struct ConfigDialog’
polymerconfig.cc: In member function ‘void polymerConfig::save(KConfig*)’:
polymerconfig.cc:138: error: invalid use of undefined type ‘struct ConfigDialog’
polymerconfig.h:36: error: forward declaration of ‘struct ConfigDialog’
polymerconfig.cc:143: error: invalid use of undefined type ‘struct ConfigDialog’
polymerconfig.h:36: error: forward declaration of ‘struct ConfigDialog’
polymerconfig.cc:144: error: invalid use of undefined type ‘struct ConfigDialog’
polymerconfig.h:36: error: forward declaration of ‘struct ConfigDialog’
polymerconfig.cc:145: error: invalid use of undefined type ‘struct ConfigDialog’
polymerconfig.h:36: error: forward declaration of ‘struct ConfigDialog’
polymerconfig.cc:146: error: invalid use of undefined type ‘struct ConfigDialog’
polymerconfig.h:36: error: forward declaration of ‘struct ConfigDialog’
polymerconfig.cc:147: error: invalid use of undefined type ‘struct ConfigDialog’
polymerconfig.h:36: error: forward declaration of ‘struct ConfigDialog’
polymerconfig.cc:148: error: invalid use of undefined type ‘struct ConfigDialog’
polymerconfig.h:36: error: forward declaration of ‘struct ConfigDialog’
polymerconfig.cc:149: error: invalid use of undefined type ‘struct ConfigDialog’
polymerconfig.h:36: error: forward declaration of ‘struct ConfigDialog’
polymerconfig.cc:150: error: invalid use of undefined type ‘struct ConfigDialog’
polymerconfig.h:36: error: forward declaration of ‘struct ConfigDialog’
polymerconfig.cc:151: error: invalid use of undefined type ‘struct ConfigDialog’
polymerconfig.h:36: error: forward declaration of ‘struct ConfigDialog’
polymerconfig.cc: In member function ‘void polymerConfig::defaults()’:
polymerconfig.cc:162: error: invalid use of undefined type ‘struct ConfigDialog’
polymerconfig.h:36: error: forward declaration of ‘struct ConfigDialog’
polymerconfig.cc:167: error: invalid use of undefined type ‘struct ConfigDialog’
polymerconfig.h:36: error: forward declaration of ‘struct ConfigDialog’
polymerconfig.cc:168: error: invalid use of undefined type ‘struct ConfigDialog’
polymerconfig.h:36: error: forward declaration of ‘struct ConfigDialog’
polymerconfig.cc:169: error: invalid use of undefined type ‘struct ConfigDialog’
polymerconfig.h:36: error: forward declaration of ‘struct ConfigDialog’
polymerconfig.cc:170: error: invalid use of undefined type ‘struct ConfigDialog’
polymerconfig.h:36: error: forward declaration of ‘struct ConfigDialog’
polymerconfig.cc:171: error: invalid use of undefined type ‘struct ConfigDialog’
polymerconfig.h:36: error: forward declaration of ‘struct ConfigDialog’
polymerconfig.cc:172: error: invalid use of undefined type ‘struct ConfigDialog’
polymerconfig.h:36: error: forward declaration of ‘struct ConfigDialog’
polymerconfig.cc:173: error: invalid use of undefined type ‘struct ConfigDialog’
polymerconfig.h:36: error: forward declaration of ‘struct ConfigDialog’
polymerconfig.cc:174: error: invalid use of undefined type ‘struct ConfigDialog’
polymerconfig.h:36: error: forward declaration of ‘struct ConfigDialog’
polymerconfig.cc:175: error: invalid use of undefined type ‘struct ConfigDialog’
polymerconfig.h:36: error: forward declaration of ‘struct ConfigDialog’
make[3]: *** [polymerconfig.lo] Error 1
make[3]: Leaving directory `/home/francesco/polymer/client/config'
make[2]: *** [all-recursive] Error 1
make[2]: Leaving directory `/home/francesco/polymer/client'
make[1]: *** [all-recursive] Error 1
make[1]: Leaving directory `/home/francesco/polymer'
make: *** [all] Error 2 - Oct 12 2005
Very Silent feature in KDE 3.5

KDE Plasma Screenshots 18 comments

by zammi
Score 50.0%
Sep 26 2005
How didi you obtained the rounded selection of icon text shown in screenshot 2? And is it possible to change kmenu text color? - Sep 28 2005
ok, it worked... but how you changed k-menu button color? - Sep 27 2005
Is the kmenu button in your screenshot the default for 3.5? - Sep 27 2005
Leds-1.0

Ice-WM Themes 37 comments

Score 50.0%
Sep 15 2005
I think it's a nice windeco (I'm using it right now) but IMHO it's nothing more than a Baghira-like windeco with different buttons; so I think it would be a wonderful thing to have baghira modified so that buttons can be customized (via jpg, png, pick the on you like) - Sep 16 2005
kuake by hunt0r

System Software 48 comments

Score 50.0%
Sep 24 2005
Since Beta2 I have this error compiling kuake, the first beta works fine...
I'm using kde 3.4.2 on suse 9.2

/opt/kde3/bin/meinproc --check --cache index.cache.bz2 ./index.docbook
XPath error : Undefined variable
compilation error: file /opt/kde3/share/apps/ksgmltools2/docbook/xsl/html/autotoc.xsl line 544 element div
Attribute template class: failed to compile $titles
XPath error : Undefined variable
compilation error: file /opt/kde3/share/apps/ksgmltools2/docbook/xsl/html/lists.xsl line 735 element ol
Attribute template type: failed to compile $numeration
XPath error : Undefined variable
compilation error: file /opt/kde3/share/apps/ksgmltools2/docbook/xsl/html/callout.xsl line 158 element img
Attribute template src: failed to compile $callout.graphics.path
XPath error : Undefined variable
compilation error: file /opt/kde3/share/apps/ksgmltools2/docbook/xsl/html/callout.xsl line 158 element img
Attribute template alt: failed to compile $conum
XPath error : Undefined variable
compilation error: file /opt/kde3/share/apps/ksgmltools2/docbook/xsl/html/formal.xsl line 19 element div
Attribute template class: failed to compile $class
XPath error : Undefined variable
compilation error: file /opt/kde3/share/apps/ksgmltools2/docbook/xsl/html/formal.xsl line 71 element div
Attribute template class: failed to compile $class
XPath error : Undefined variable
compilation error: file /opt/kde3/share/apps/ksgmltools2/docbook/xsl/html/inline.xsl line 856 element a
Attribute template href: failed to compile $chunkbase
XPath error : Undefined variable
compilation error: file /opt/kde3/share/apps/ksgmltools2/docbook/xsl/html/inline.xsl line 934 element code
Attribute template class: failed to compile $class
XPath error : Undefined variable
compilation error: file /opt/kde3/share/apps/ksgmltools2/docbook/xsl/html/html.xsl line 24 element a
Attribute template name: failed to compile $id
XPath error : Undefined variable
compilation error: file /opt/kde3/share/apps/ksgmltools2/docbook/xsl/html/index.xsl line 115 element a
Attribute template name: failed to compile $id
XPath error : Undefined variable
concat('ln-',$id,$html.ext)
^
compilation error: file /opt/kde3/share/apps/ksgmltools2/docbook/xsl/html/titlepage.xsl line 475 element a
Attribute template href: failed to compile concat('ln-',$id,$html.ext)
XPath error : Undefined variable
compilation error: file /opt/kde3/share/apps/ksgmltools2/docbook/xsl/html/titlepage.xsl line 502 element a
Attribute template name: failed to compile $id
XPath error : Undefined variable
compilation error: file /opt/kde3/share/apps/ksgmltools2/docbook/xsl/html/titlepage.xsl line 780 element a
Attribute template name: failed to compile $id
XPath error : Undefined variable
compilation error: file /opt/kde3/share/apps/ksgmltools2/docbook/xsl/html/docbook.xsl line 137 element base
Attribute template href: failed to compile $html.base
XPath error : Undefined variable
substring-before($stylesheets, ' ')
^
compilation error: file /opt/kde3/share/apps/ksgmltools2/docbook/xsl/html/docbook.xsl line 197 element link
Attribute template href: failed to compile substring-before($stylesheets, ' ')
XPath error : Undefined variable
compilation error: file /opt/kde3/share/apps/ksgmltools2/customization/kde-navig.xsl line 43 element div
Attribute template style: failed to compile $kde.common
XPath error : Undefined variable
compilation error: file /opt/kde3/share/apps/ksgmltools2/customization/kde-navig.xsl line 47 element img
Attribute template src: failed to compile $kde.common
XPath error : Undefined variable
compilation error: file /opt/kde3/share/apps/ksgmltools2/customization/kde-navig.xsl line 50 element img
Attribute template src: failed to compile $kde.common
XPath error : Undefined variable
compilation error: file /opt/kde3/share/apps/ksgmltools2/customization/kde-navig.xsl line 198 element div
Attribute template style: failed to compile $kde.common
XPath error : Undefined variable
compilation error: file /opt/kde3/share/apps/ksgmltools2/customization/kde-navig.xsl line 200 element img
Attribute template src: failed to compile $kde.common
XPath error : Undefined variable
compilation error: file /opt/kde3/share/apps/ksgmltools2/customization/kde-navig.xsl line 203 element img
Attribute template src: failed to compile $kde.common
unable to parse ./index.docbook
make[3]: *** [index.cache.bz2] Error 1
make[3]: Leaving directory `/home/francesco/kuake-0.4Beta3/doc/en'
make[2]: *** [all-recursive] Error 1
make[2]: Leaving directory `/home/francesco/kuake-0.4Beta3/doc'
make[1]: *** [all-recursive] Error 1
make[1]: Leaving directory `/home/francesco/kuake-0.4Beta3'
make: *** [all] Error 2 - Sep 16 2005
Another cool feature would be the ability to use the same sessions as Konsole - Sep 12 2005
Tolosa

KDE 3.x Window Decorations 11 comments

by Momo
Score 50.0%
Jun 29 2005
On suse 9.2 - kde 3.4.1 :( - Jul 01 2005
KPager2 for Kicker

Various KDE 1.-4. Improvements 176 comments

Score 50.0%
Mar 31 2005
"Applet could not be loaded"

I tried both compiling from source and loki's rpm; Suse 9.2 with kde 3.4 - Mar 31 2005
ASSK beta3 Alienware

KDE 3.x Window Decorations 11 comments

Score 50.0%
Mar 08 2005
configure: error: cannot find sources (acinclude.m4) in . or ..

Suse 9.2 - KDE 3.4 - Mar 09 2005
Netscape Hack

Wallpaper Other 4 comments

by dflax
Score 50.0%
Jan 28 2005
Nice idea for a Konqueror throbber... - Jan 28 2005
SVG Deco - concept

KDE 3.x Window Decorations 23 comments

Score 50.0%
May 05 2005
It's a nice windec, maybe it's not really original but it's good.
I don't understand why kde windecs are so few; GNOME windecs are more colorful and original IMHO - Jan 25 2005
KDE CVS Translucency

KDE Plasma Screenshots 5 comments

by kwr2k
Score 50.0%
Jan 19 2005
I don't think it's simply a matter of how long you run it before it crashes; I believe it depends on how intensively the window manager works. I found that the compositor always crashes when attempting to manage intensive or strange tasks, such as lots of windows (quanta at startup) or kopete popups - Jan 21 2005
I tried to use it, but it's still too unstable; for example, starting Quanta crashes x.org because of the too many windows opened at once. - Jan 20 2005
KDE + XFWM4

KDE Plasma Screenshots 5 comments

Score 50.0%
Jan 14 2005
I use Taskbar v2, kpager2 and taskbar v2 :) You can find them here - Jan 14 2005
July 15

KDE Plasma Screenshots 2 comments

Score 50.0%
Jul 15 2004
It's IceWM: Glass

http://kdelook.org/content/show.php?content=14253 - Jul 16 2004
Baghira SuSE 9.x RPM

KDE 3.5 Themes 154 comments

Score 50.0%
Feb 12 2005
I tried to delete all & install again, with no success... I'll send you a screenshot ASAP... - Jul 01 2004
It installed fine, but the configure button in KDE Control Center is disabled :(
Suse 9.0 - KDE 3.2.3 - Jun 30 2004
I have the same problem with the new RPM... :( - Jun 03 2004
I have no problem with Glcore, but when I install the rpm Baghira does not show in the Styles list!
Also, the sf rpm is corrupted and not installable...

error: baghira-0.3o-1-SuSE.i586.rpm: MD5 digest: BAD Expected(9e840e1038798af7eb519bf43d08ce85) != (43ee646bbb1782286125c2ac0f17e48c)
error: baghira-0.3o-1-SuSE.i586.rpm cannot be installed - Mar 18 2004
Same here... all the files seem correctly in place but the style doesn't show up in the list.
Also, the Suse 9 rpm on sourceforge seems to be corrupted... - Mar 16 2004
june 2004... minimalistic? ;)

KDE Plasma Screenshots 3 comments

Score 50.0%
Jun 25 2004
GTK-QT Theme Engine

GTK1 Themes 280 comments

Score 50.0%
Mar 10 2008
Does anyone have an RPM for Suse 9.0? - Jun 18 2004
I hope this new versions fixes baghira-syle scrollbars, which where rendered poorly in 0.3... - Jun 16 2004
KSmoothDock

Various Plasma 5 Improvements 703 comments

Score 75.7%
Dec 23 2019
Is there a way to configure or exclude them? I don't lile the default colors, and sometimes I find them a bit sluggish...

Great work, anyway! :) - May 31 2004
Skippy

Various KDE 1.-4. Improvements 43 comments

Score 50.0%
May 19 2004
Works like a charm! Thanx :) - May 19 2004
Picwiz

Graphic Apps 7 comments

Score 50.0%
Dec 31 2003
...doesn't work for me :(
It always resizes at 640x480 - May 14 2004
AKDC Beta3 preview 2(see changelog)

KDE 3.x Window Decorations 357 comments

Score 50.0%
Dec 20 2004
Your screenshot shows a Suse desktop but you didn't provide a Suse RPM... why? :( - May 12 2004
I think a possibly good feature would be customizable button colors, so you won't stick with Nvidia green if you use a blue or red based desktop...
And perhaps you could be the right man in the right place to port Cryogenic Alloy to KDE ;)

http://kdelook.org/content/show.php?content=12475 - May 07 2004
Since you developed this on Suse, I hope you'll provide an RPM :)
Also, how did you manage to have windows dropshadows under Suse? Is there a patched RPM out there? - May 07 2004
Cryogenic/Aluminium Alloy

Various KDE 1.-4. Styles 9 comments

Score 50.0%
May 07 2004
I was thinking about it... I have no experience in creating kde themes; perhaps an Icewm decoration would be easier, but I lack free time at the moment :( - May 07 2004
RevRedux 2

Cursors 13 comments

Score 50.0%
Jun 16 2004
Worked like a charm :D
Thanx a lot! - Apr 20 2004
I found some cursors are still missing: the watches and the resize window cursors.
Nice work btw, it's my favourite cursor theme

KDE 3.2.2 on Suse 9 - Apr 20 2004
KWin drop shadow patches

Various KDE 1.-4. Improvements 134 comments

Score 50.0%
Apr 29 2004
Does anyone provide a Suse 9 RPM of this great patch? - Mar 19 2004
Transparent grey simplicity

KDE Plasma Screenshots 2 comments

Score 50.0%
Mar 03 2004
OFFSPRING rule!
Where did you find it? - Mar 04 2004
KXDocker with REAL Transparency

KXDocker 154 comments

Score 50.0%
Apr 15 2006
I'm really interested in your Suse 9.0 rpm, but I can't find it on your website... :( - Mar 01 2004
Plastik

KDE 3.0-3.4 Themes 233 comments

by ceebx
Score 50.0%
Oct 17 2003
I need a 9.2 RPM for Plastik; after I upgraded from 9.1 the win decoration doesn't work anymore :( - Nov 04 2003
OS X Jaguar look

KDE Plasma Screenshots 7 comments

by gg3po
Score 50.0%
Jun 14 2003
I also noted your icons folder; it doesn't seem to be a theme here on kdelook, where did you find them? I'm looking for a nice Photoshop icon... - Jun 18 2003
Where did you get the finder bar?? - Jun 17 2003