Image 01
profile-image

MoOnShIn3

my name , Switzerland
Capitaine Cursors

Cursors 83 comments

Score 86.8%
Mar 07 2019
Whoa that's nice, thanks! - Oct 28 2017
Simple monitor

Plasma 4 Widgets 27 comments

Score 53.3%
Feb 04 2009
i love this widget! please add some settings to it (like refresh time, colors, borders...) - Aug 07 2010
KDE Trash

Karamba & Superkaramba 35 comments

Score 50.0%
Jun 27 2007
what about watching deleted ***films directly in the trash icon? ;-) - Dec 30 2007
Kdate

Karamba & Superkaramba 5 comments

Score 50.0%
Sep 21 2007
can't find it :( please post link! - Dec 30 2007
dbClock

Karamba & Superkaramba 5 comments

Score 50.0%
Oct 11 2007
i really like the design of the clock (first piece) - Dec 30 2007
My Computer

Karamba & Superkaramba 1 comment

Score 50.0%
Oct 25 2007
how have you made this nice clock? :) - Dec 30 2007
Domino

KDE 3.5 Themes 404 comments

Score 58.0%
Feb 16 2007
that works,thanks! ...WOOOOW i really like this theme =))

GreetZ MoOnShIn3 - Sep 18 2007
looks great but installation doesn't work...



/usr/bin/xmllint checking if client should be compiled... yes checking if domino should be compiled... yes checking if dominoConfig should be compiled... yes

configure: creating ./config.status
wrong input (flag != 4) at admin/conf.change.pl line 117, line 1220.

config.status: creating Makefile
config.status: creating client/Makefile
config.status: creating client/config/Makefile
config.status: creating domino/Makefile
config.status: creating dominoConfig/Makefile
config.status: creating config.h
config.status: executing depfiles commands
Good - your configure finished. Start make now
Sources configured.
Building sources...
/usr/bin/make
/usr/bin/make all-recursive
make[1]: Betrete Verzeichnis '/tmp/kompile-tmp/domino-0.4'
Making all in domino
make[2]: Betrete Verzeichnis '/tmp/kompile-tmp/domino-0.4/domino' /usr/share/qt3/bin/moc ./domino.h -o domino.moc
if /bin/bash ../libtool --silent --tag=CXX --mode=compile g++ -DHAVE_CONFIG_H -I. -I. -I.. -I/usr/include/kde -I/usr/share/qt3/include -I. -DQT_THREAD_SUPPORT -D_REENTRANT -Wno-long-long -Wundef -ansi -D_XOPEN_SOURCE=500 -D_BSD_SOURCE -Wcast-align -Wconversion -Wchar-subscripts -Wall -W -Wpointer-arith -O2 -Wformat-security -Wmissing-format-attribute -Wno-non-virtual-dtor -fno-exceptions -fno-check-new -fno-common -DQT_PLUGIN -I/usr/include/freetype2 -MT domino.lo -MD -MP -MF ".deps/domino.Tpo" -c -o domino.lo domino.cpp; \ then mv -f ".deps/domino.Tpo" ".deps/domino.Plo"; else rm -f ".deps/domino.Tpo"; exit 1; fi
if /bin/bash ../libtool --silent --tag=CXX --mode=compile g++ -DHAVE_CONFIG_H -I. -I. -I.. -I/usr/include/kde -I/usr/share/qt3/include -I. -DQT_THREAD_SUPPORT -D_REENTRANT -Wno-long-long -Wundef -ansi -D_XOPEN_SOURCE=500 -D_BSD_SOURCE -Wcast-align -Wconversion -Wchar-subscripts -Wall -W -Wpointer-arith -O2 -Wformat-security -Wmissing-format-attribute -Wno-non-virtual-dtor -fno-exceptions -fno-check-new -fno-common -DQT_PLUGIN -I/usr/include/freetype2 -MT misc.lo -MD -MP -MF ".deps/misc.Tpo" -c -o misc.lo misc.cpp; \
then mv -f ".deps/misc.Tpo" ".deps/misc.Plo"; else rm -f ".deps/misc.Tpo"; exit 1; fi
/bin/bash ../libtool --silent --tag=CXX --mode=link g++ -Wno-long-long -Wundef -ansi -D_XOPEN_SOURCE=500 -D_BSD_SOURCE -Wcast-align -Wconversion -Wchar-subscripts -Wall -W -Wpointer-arith -O2 -Wformat-security -Wmissing-format-attribute -Wno-non-virtual-dtor -fno-exceptions -fno-check-new -fno-common -DQT_PLUGIN -I/usr/include/freetype2 -o domino.la -rpath /usr/lib/kde3/plugins/styles -L/usr/share/qt3/lib -L/usr/lib -avoid-version -module -no-undefined -Wl,--no-undefined -Wl,--allow-shlib-undefined -R /usr/lib -R /usr/lib -R /usr/share/qt3/lib -R /usr/lib -module -R /usr/lib -R /usr/lib -R /usr/share/qt3/lib -R /usr/lib domino.lo misc.lo -lkdeui -lkutils -lqt-mt -lz -lpng -lz -lm -lXext -lX11 -lSM -lICE -lpthread -lkdefx -lXrender -lXft -lkdecore
make[2]: Verlasse Verzeichnis '/tmp/kompile-tmp/domino-0.4/domino'
Making all in dominoConfig
make[2]: Betrete Verzeichnis '/tmp/kompile-tmp/domino-0.4/dominoConfig' /usr/share/qt3/bin/moc ./dominoconf.h -o dominoconf.moc if /bin/bash ../libtool --silent --tag=CXX --mode=compile g++ -DHAVE_CONFIG_H -I. -I. -I.. -I/usr/include/kde -I/usr/share/qt3/include -I. -I/usr/include/freetype2 -DQT_THREAD_SUPPORT -D_REENTRANT -Wno-long-long -Wundef -ansi -D_XOPEN_SOURCE=500 -D_BSD_SOURCE -Wcast-align -Wconversion -Wchar-subscripts -Wall -W -Wpointer-arith -O2 -Wformat-security -Wmissing-format-attribute -Wno-non-virtual-dtor -fno-exceptions -fno-check-new -fno-common -MT dominoconf.lo -MD -MP -MF ".deps/dominoconf.Tpo" -c -o dominoconf.lo dominoconf.cpp; \ then mv -f ".deps/dominoconf.Tpo" ".deps/dominoconf.Plo"; else rm -f ".deps/dominoconf.Tpo"; exit 1; fi
/bin/bash ../libtool --silent --tag=CXX --mode=link g++ -Wno-long-long -Wundef -ansi -D_XOPEN_SOURCE=500 -D_BSD_SOURCE -Wcast-align -Wconversion -Wchar-subscripts -Wall -W -Wpointer-arith -O2 -Wformat-security -Wmissing-format-attribute -Wno-non-virtual-dtor -fno-exceptions -fno-check-new -fno-common -o kstyle_domino_config.la -rpath /usr/lib/kde3 -L/usr/share/qt3/lib -L/usr/lib -avoid-version -module -no-undefined -Wl,--no-undefined -Wl,--allow-shlib-undefined -R /usr/lib -R /usr/lib -R /usr/share/qt3/lib -R /usr/lib -module dominoconf.lo -lkdeui ../domino/domino.la -lqt-mt -lz -lpng -lz -lm -lXext -lX11 -lSM -lICE -lpthread -lkdecore -lkdefx -lkio

libtool: link: warning: `/usr/share/qt3/lib/libqt-mt.la' seems to be moved
*** Warning: Linking the shared library kstyle_domino_config.la against the loadable module *** domino.so is not portable!
make[2]: Verlasse Verzeichnis '/tmp/kompile-tmp/domino-0.4/dominoConfig'
Making all in client
make[2]: Betrete Verzeichnis '/tmp/kompile-tmp/domino-0.4/client'
Making all in .
make[3]: Betrete Verzeichnis '/tmp/kompile-tmp/domino-0.4/client' /usr/share/qt3/bin/moc ./dominoclient.h -o dominoclient.moc if /bin/bash ../libtool --silent --tag=CXX --mode=compile g++ -DHAVE_CONFIG_H -I. -I. -I.. -I/usr/include/kde -I/usr/share/qt3/include -I. -I/usr/include/kde/kwin -DQT_THREAD_SUPPORT -D_REENTRANT -Wno-long-long -Wundef -ansi -D_XOPEN_SOURCE=500 -D_BSD_SOURCE -Wcast-align -Wconversion -Wchar-subscripts -Wall -W -Wpointer-arith -O2 -Wformat-security -Wmissing-format-attribute -Wno-non-virtual-dtor -fno-exceptions -fno-check-new -fno-common -MT dominoclient.lo -MD -MP -MF ".deps/dominoclient.Tpo" -c -o dominoclient.lo dominoclient.cpp; \ then mv -f ".deps/dominoclient.Tpo" ".deps/dominoclient.Plo"; else rm -f ".deps/dominoclient.Tpo"; exit 1; fi
In file included from dominoclient.cpp:10: dominoclient.h:13:31: error: kcommondecoration.h: No such file or directory dominoclient.h:14:32: error: kdecorationfactory.h: No such file or directory
dominoclient.h:23: error: expected class-name before '{' token
dominoclient.h:27: error: ISO C++ forbids declaration of 'KDecoration' with no type dominoclient.h:27: error: expected ';' before '*' token dominoclient.h:29: error: 'Ability' has not been declared dominoclient.h:52: error: expected class-name before '{' token dominoclient.h:54: error: expected `)' before 'type' dominoclient.h:71: error: expected class-name before '{' token dominoclient.h:74: error: expected `)' before '*' token dominoclient.h:80: error: 'DecorationBehaviour' has not been declared dominoclient.h:81: error: 'LayoutMetric' has not been declared dominoclient.h:81: error: expected ',' or '...' before '*' token dominoclient.h:81: error: ISO C++ forbids declaration of 'KCommonDecorationButton' with no type dominoclient.h:82: error: ISO C++ forbids declaration of 'KCommonDecorationButton' with no type dominoclient.h:82: error: 'KCommonDecorationButton' declared as a 'virtual' field dominoclient.h:82: error: expected ';' before '*' token dominoclient.h:105: error: ISO C++ forbids declaration of 'QBu
tton' with no type dominoclient.h:105: error: expected ';' before '*' token dominoclient.h:81: error: default argument missing for parameter 3 of 'virtual int Domino::DominoClient::layoutMetric(int, bool, int) const'
dominoclient.cpp:119: error: expected constructor, destructor, or type conversion before '*' token dominoclient.cpp: In member function 'bool Domino::DominoHandler::reset(long unsigned int)': dominoclient.cpp:128: error: 'SettingColors' was not declared in this scope dominoclient.cpp:135: error: 'SettingDecoration' was not declared in this scope dominoclient.cpp:135: error: 'SettingFont' was not declared in this scope dominoclient.cpp:135: error: 'SettingBorder' was not declared in this scope dominoclient.cpp:138: error: 'resetDecorations' was not declared in this scope dominoclient.cpp: In member function 'long unsigned int Domino::DominoHandler::readConfig(bool)': dominoclient.cpp:149: error: 'options' was not declared in this scope dominoclient.cpp:177: error: 'SettingColors' was not declared in this scope dominoclient.cpp: At global scope: dominoclient.cpp:491: error: 'bool Domino::DominoHandler::supports' is not a static member of 'class Domino::DominoHandler' dominoclient.cpp:491: error: 'Ability' was n
ot declared in this scope dominoclient.cpp:492: error: expected ',' or ';' before '{' token dominoclient.cpp:514: error: expected `)' before 'type' dominoclient.cpp: In member function 'void Domino::DominoButton::reset(long unsigned int)': dominoclient.cpp:540: error: 'SizeChange' was not declared in this scope dominoclient.cpp:540: error: 'ManualReset' was not declared in this scope dominoclient.cpp:541: error: 'setBackgroundOrigin' was not declared in this scope dominoclient.cpp:542: error: 'setErasePixmap' was not declared in this scope dominoclient.cpp:546: error: 'DecorationReset' was not declared in this scope dominoclient.cpp:546: error: 'ManualReset' was not declared in this scope dominoclient.cpp:546: error: 'SizeChange' was not declared in this scope dominoclient.cpp:546: error: 'StateChange' was not declared in this scope dominoclient.cpp:547: error: 'class Domino::DominoButton' has no member named 'update' dominoclient.cpp: In member function 'void Domino::DominoButton::drawButton(QPainter*)': dom
make[3]: Verlasse Verzeichnis '/tmp/kompile-tmp/domino-0.4/client'
make[2]: Verlasse Verzeichnis '/tmp/kompile-tmp/domino-0.4/client'
inoclient.cpp:559: error: 'isDown' was not declared in this scope dominoclient.cpp:559: error: 'isOn' was not declared in this scope dominoclient.cpp:560: error: 'decoration' was not declared in this scope dominoclient.cpp:561: error: 'type' was not declared in this scope dominoclient.cpp:562: error: 'CloseButton' was not declared in this scope dominoclient.cpp:565: error: 'HelpButton' was not declared in this scope dominoclient.cpp:568: error: 'MinButton' was not declared in this scope dominoclient.cpp:571: error: 'MaxButton' was not declared in this scope dominoclient.cpp:574: error: 'OnAllDesktopsButton' was not declared in this scope dominoclient.cpp:577: error: 'ShadeButton' was not declared in this scope dominoclient.cpp:580: error: 'AboveButton' was not declared in this scope dominoclient.cpp:583: error: 'BelowButton' was not declared in this scope dominoclient.cpp:586: error: 'MenuButton' was not declared in this scope dominoclient.cpp:592: error: 'type' was not declared in this scope dominoclient.cpp
make[1]: Verlasse Verzeichnis '/tmp/kompile-tmp/domino-0.4'
:592: error: 'MenuButton' was not declared in this scope dominoclient.cpp: In member function 'void Domino::DominoButton::enterEvent(QEvent*)': dominoclient.cpp:603: error: 'class Domino::DominoClient' has no member named 'isActive' dominoclient.cpp:607: error: 'repaint' was not declared in this scope dominoclient.cpp: In member function 'void Domino::DominoButton::leaveEvent(QEvent*)': dominoclient.cpp:614: error: 'repaint' was not declared in this scope dominoclient.cpp: At global scope: dominoclient.cpp:621: error: expected `)' before '*' token dominoclient.cpp:654: error: 'bool Domino::DominoClient::decorationBehaviour' is not a static member of 'class Domino::DominoClient' dominoclient.cpp:654: error: 'DecorationBehaviour' was not declared in this scope dominoclient.cpp:654: error: expected ',' or ';' before 'const' dominoclient.cpp:668: error: 'int Domino::DominoClient::layoutMetric' is not a static member of 'class Domino::DominoClient' dominoclient.cpp:668: error: 'LayoutMetric' was not declared in th
is scope dominoclient.cpp:668: error: expected primary-expression before 'bool' dominoclient.cpp:668: error: expected primary-expression before 'const' dominoclient.cpp:668: error: initializer expression list treated as compound expression dominoclient.cpp:668: error: expected ',' or ';' before 'const' dominoclient.cpp:720: error: expected constructor, destructor, or type conversion before '*' token dominoclient.cpp: In member function 'void Domino::DominoClient::init()': dominoclient.cpp:763: error: 'menuButton' was not declared in this scope dominoclient.cpp:766: error: 'KDecoration' has not been declared dominoclient.cpp:766: error: 'WNoAutoErase' was not declared in this scope dominoclient.cpp:766: error: 'WStaticContents' was not declared in this scope dominoclient.cpp:767: error: 'setMainWidget' was not declared in this scope dominoclient.cpp:769: error: 'widget' was not declared in this scope dominoclient.cpp:769: error: 'NoBackground' was not declared in this scope dominoclient.cpp:773: error: 'KCommo
nDecoration' has not been declared dominoclient.cpp:773: error: 'SettingButtons' was not declared in this scope dominoclient.cpp:775: error: 'connect' was not declared in this scope dominoclient.cpp: In member function 'void Domino::DominoClient::createLayout()': dominoclient.cpp:784: error: 'widget' was not declared in this scope dominoclient.cpp: In member function 'void Domino::DominoClient::reset(long unsigned int)': dominoclient.cpp:858: error: 'widget' was not declared in this scope dominoclient.cpp:859: error: 'KCommonDecoration' has not been declared dominoclient.cpp:860: error: 'KCommonDecoration' has not been declared dominoclient.cpp: In member function 'void Domino::DominoClient::updateMask()': dominoclient.cpp:869: error: 'maximizeMode' was not declared in this scope dominoclient.cpp:869: error: 'MaximizeFull' was not declared in this scope dominoclient.cpp:869: error: 'options' was not declared in this scope dominoclient.cpp:870: error: 'clearMask' was not declared in this scope dominoclient.cpp
:873: error: 'widget' was not declared in this scope dominoclient.cpp:880: error: 'setMask' was not declared in this scope dominoclient.cpp: In member function 'void Domino::DominoClient::updateCaption()': dominoclient.cpp:892: error: 'buttonsLeftWidth' was not declared in this scope dominoclient.cpp:893: error: 'buttonsRightWidth' was not declared in this scope dominoclient.cpp:895: error: 'options' was not declared in this scope dominoclient.cpp:897: error: 'caption' was not declared in this scope dominoclient.cpp:903: error: 'KDecorationDefines' has not been declared dominoclient.cpp:903: error: 'isActive' was not declared in this scope dominoclient.cpp: In member function 'void Domino::DominoClient::activeChange()': dominoclient.cpp:914: error: 'updateButtons' was not declared in this scope dominoclient.cpp: In member function 'void Domino::DominoClient::iconChange()': dominoclient.cpp:920: error: 'menuButton' was not declared in this scope dominoclient.cpp:922: error: 'KDecoration' has not been declared
dominoclient.cpp:922: error: incomplete type 'QIconSet' used in nested name specifier dominoclient.cpp:922: error: incomplete type 'QIconSet' used in nested name specifier dominoclient.cpp: In member function 'void Domino::DominoClient::menuButtonDestroyed()': dominoclient.cpp:932: error: 'menuButton' was not declared in this scope dominoclient.cpp: In member function 'void Domino::DominoClient::slotShade()': dominoclient.cpp:937: error: 'isSetShade' was not declared in this scope dominoclient.cpp:937: error: 'setShade' was not declared in this scope dominoclient.cpp: In member function 'void Domino::DominoClient::borders(int&, int&, int&, int&) const': dominoclient.cpp:944: error: 'LM_BorderLeft' was not declared in this scope dominoclient.cpp:945: error: 'LM_BorderRight' was not declared in this scope dominoclient.cpp:946: error: 'LM_BorderBottom' was not declared in this scope dominoclient.cpp:947: error: 'LM_TitleHeight' was not declared in this scope dominoclient.cpp:948: error: 'LM_TitleEdgeTop' was not
declared in this scope dominoclient.cpp:949: error: 'LM_TitleEdgeBottom' was not declared in this scope dominoclient.cpp:951: error: 'widget' was not declared in this scope dominoclient.cpp: In member function 'void Domino::DominoClient::shadeChange()': dominoclient.cpp:957: error: 'isSetShade' was not declared in this scope dominoclient.cpp:968: error: 'widget' was not declared in this scope dominoclient.cpp: In member function 'void Domino::DominoClient::resize(const QSize&)': dominoclient.cpp:974: error: 'widget' was not declared in this scope dominoclient.cpp:975: error: 'maximizeMode' was not declared in this scope dominoclient.cpp:975: error: 'MaximizeFull' was not declared in this scope dominoclient.cpp:975: error: 'options' was not declared in this scope dominoclient.cpp: In member function 'void Domino::DominoClient::resizeEvent(QResizeEvent*)': dominoclient.cpp:999: error: 'KCommonDecoration' has not been declared dominoclient.cpp: In member function 'bool Domino::DominoClient::eventFilter(QObject*
, QEvent*)': dominoclient.cpp:1028: error: 'mouseDoubleClickEvent' was not declared in this scope dominoclient.cpp:1031: error: 'isSetShade' was not declared in this scope dominoclient.cpp:1032: error: 'wheelEvent' was not declared in this scope dominoclient.cpp:1035: error: 'processMousePressEvent' was not declared in this scope dominoclient.cpp:1040: error: 'updateButtons' was not declared in this scope dominoclient.cpp: In member function 'virtual void Domino::TitleBar::enterEvent(QEvent*)': dominoclient.cpp:1060: error: 'class Domino::DominoClient' has no member named 'isActive' dominoclient.cpp:1066: error: 'class Domino::DominoClient' has no member named 'updateButtons' dominoclient.cpp: In member function 'virtual bool Domino::TitleBar::eventFilter(QObject*, QEvent*)': dominoclient.cpp:1074: error: 'class Domino::DominoClient' has no member named 'isActive' dominoclient.cpp:1076: error: expected type-specifier before 'QButton' dominoclient.cpp:1076: error: expected `>' before 'QButton' dominoclient.cpp
:1076: error: expected `(' before 'QButton' dominoclient.cpp:1076: error: 'QButton' was not declared in this scope dominoclient.cpp:1076: error: expected primary-expression before '>' token dominoclient.cpp:1076: error: expected `)' before '{' token dominoclient.cpp:1083: error: expected primary-expression before '}' token dominoclient.cpp:1083: error: expected `;' before '}' token dominoclient.cpp: At global scope: dominoclient.cpp:1176: error: expected constructor, destructor, or type conversion before '*' token dominoclient.moc: In static member function 'static QMetaObject* Domino::DominoClient::staticMetaObject()': dominoclient.moc:54: error: 'KCommonDecoration' has not been declared dominoclient.moc: In member function 'virtual void* Domino::DominoClient::qt_cast(const char*)': dominoclient.moc:78: error: 'KCommonDecoration' has not been declared dominoclient.moc: In member function 'virtual bool Domino::DominoClient::qt_invoke(int, QUObject*)': dominoclient.moc:87: error: 'KCommonDecoration' has not be
en declared dominoclient.moc: In member function 'virtual bool Domino::DominoClient::qt_emit(int, QUObject*)': dominoclient.moc:94: error: 'KCommonDecoration' has not been declared dominoclient.moc: In member function 'virtual bool Domino::DominoClient::qt_property(int, int, QVariant*)': dominoclient.moc:100: error: 'KCommonDecoration' has not been declared
make[3]: *** [dominoclient.lo] Fehler 1
make[2]: *** [all-recursive] Fehler 1
make[1]: *** [all-recursive] Fehler 1
make: *** [all] Fehler 2
Error during sources build. Installation aborted!


any ideas to fix?

GreetZ MoOnShIn3 - Sep 06 2007
Knifty (KDE >= 3.2)

KDE 3.x Window Decorations 78 comments

by ceebx
Score 50.0%
Jul 21 2004
during the make command it aborts installation...

----------
make[3]: Betrete Verzeichnis '/tmp/kompile-tmp/knifty-0.4.2/client' source='knifty.cpp' object='knifty.lo' libtool=yes \ depfile='.deps/knifty.Plo' tmpdepfile='.deps/knifty.TPlo' \ depmode=gcc3 /bin/bash ../admin/depcomp \ /bin/bash ../libtool --silent --mode=compile --tag=CXX g++ -DHAVE_CONFIG_H -I. -I. -I.. -I/usr/include/kde -I/usr/share/qt3/include -I. -I/usr/include/kde/kwin -DQT_THREAD_SUPPORT -D_REENTRANT -Wnon-virtual-dtor -Wno-long-long -Wundef -Wall -pedantic -W -Wpointer-arith -Wwrite-strings -ansi -D_XOPEN_SOURCE=500 -D_BSD_SOURCE -Wcast-align -Wconversion -Wchar-subscripts -O2 -Wformat-security -Wmissing-format-attribute -fno-exceptions -fno-check-new -fno-common -DQT_PLUGIN -c -o knifty.lo `test -f 'knifty.cpp' || echo './'`knifty.cpp
In file included from knifty.cpp:12
:
knifty.h:13:25:
error: kdecoration.h: No such file or directory knifty.h:14:32: error: kdecorationfactory.h: No such file or directory
knifty.h:30: error: expected class-name before '{' token

knifty.h:35: error: ISO C++ forbids declaration of 'KDecoration' with no type

knifty.h:35: error: 'KDecoration' declared as a 'virtual' field

knifty.h:35: error: expected ';' before '*' token

knifty.h:30: warning: 'class KNifty::KniftyHandler' has virtual functions but non-virtual destructor

kniftyclient.h:25: error: expected class-name before '{' token kniftyclient.h:28: error: expected `)' before '*' token kniftyclient.h:55: error: 'Position' does not name a type kniftyclient.h:25: warning: 'class KNifty::KniftyClient' has virtual functions but non-virtual destructor kniftyclient.h: In member function 'QPixmap KNifty::KniftyClient::getTitleBarTile(bool) const': kniftyclient.h:34: error: return type 'struct QPixmap' is incomplete knifty.cpp: At global scope: knifty.cpp:43: error: expected constructor, destructor, or type conversion before '*' token knifty.cpp: In member function 'virtual bool KNifty::KniftyHandler::reset(long unsigned int)': knifty.cpp:51: error: 'options' was not declared in this scope knifty.cpp:61: error: 'resetDecorations' was not declared in this scope knifty.cpp: In member function 'bool KNifty::KniftyHandler::readConfig()': knifty.cpp:77: error: 'KDecoration' has not been declared knifty.cpp:78: error: 'BorderTiny' was not declared in this scope knifty.cpp:81: error: 'Bor
make[3]: Verlasse Verzeichnis '/tmp/kompile-tmp/knifty-0.4.2/client'
derLarge' was not declared in this scope knifty.cpp:84: error: 'BorderVeryLarge' was not declared in this scope knifty.cpp:87: error: 'BorderHuge' was not declared in this scope knifty.cpp:90: error: 'BorderVeryHuge' was not declared in this scope knifty.cpp:93: error: 'BorderOversized' was not declared in this scope knifty.cpp:96: error: 'BorderNormal' was not declared in this scope knifty.cpp: At global scope: knifty.cpp:131: error: expected constructor, destructor, or type conversion before '*' token knifty.cpp:127: warning: 'handler' defined but not used
make[2]: Verlasse Verzeichnis '/tmp/kompile-tmp/knifty-0.4.2/client'
make[3]: *** [knifty.lo] Fehler 1
make[1]: Verlasse Verzeichnis '/tmp/kompile-tmp/knifty-0.4.2'
make[2]: *** [all-recursive] Fehler 1
make[1]: *** [all-recursive] Fehler 1
make: *** [all] Fehler 2
Error during sources build. Installation aborted!
----------

what's the reason? =( - Sep 07 2007
Blended

KDE 3.x Window Decorations 24 comments

Score 50.0%
Jun 22 2006
during the make command it aborts installation...

----------
make[3]: Betrete Verzeichnis '/tmp/kompile-tmp/Blended-0.3/kwin'
if /bin/bash ../libtool --silent --mode=compile g++ -DHAVE_CONFIG_H -I. -I. -I.. -I./../../lib -I/usr/include/kde -I/usr/share/qt3/include -I. -DQT_THREAD_SUPPORT -D_REENTRANT -Wnon-virtual-dtor -Wno-long-long -Wundef -Wall -W -Wpointer-arith -Wwrite-strings -O2 -fno-exceptions -fno-check-new -fno-common -MT Blended.lo -MD -MP -MF ".deps/Blended.Tpo" -c -o Blended.lo Blended.cpp; \
then mv -f ".deps/Blended.Tpo" ".deps/Blended.Plo"; else rm -f ".deps/Blended.Tpo"; exit 1; fi
In file included from Blended.cpp:43
:
Blended.h:49:25:

error:
kdecoration.h: No such file or directory

Blended.h:50:32:

error:
kdecorationfactory.h: No such file or directory

Blended.h:130: warning: non-local variable 'Blended:: Blended::Settings_Param' uses anonymous type
Blended.h:141: error: expected class-name before '{' token Blended.h:146: error: 'BorderSize' was not declared in this scope Blended.h:146: error: template argument 1 is invalid Blended.h:148: error: ISO C++ forbids declaration of 'KDecoration' with no type Blended.h:148: error: 'KDecoration' declared as a 'virtual' field Blended.h:148: error: expected ';' before '*' token Blended.h:141: warning: 'class Blended::BlendedHandler' has virtual functions but non-virtual destructor Blended.h:293: error: expected class-name before '{' token Blended.h:298: error: expected `)' before '*' token Blended.h:312: error: 'Position' does not name a type Blended.h:293: warning: 'class Blended::BlendedClient' has virtual functions but non-virtual destructor Blended.h: In member function 'int Blended::BlendedClient::width() const': Blended.h:343: error: 'widget' was not declared in this scope Blended.h: In member function 'int Blended::BlendedClient::height() const': Blended.h:347: error: 'widget' was not declared in this scope
Blended.h: In member function 'bool Blended::BlendedClient::maximizedVertical() const': Blended.h:351: error: 'maximizeMode' was not declared in this scope Blended.h:351: error: 'MaximizeVertical' was not declared in this scope Blended.moc: In static member function 'static QMetaObject* Blended::BlendedClient::staticMetaObject()': Blended.moc:54: error: 'KDecoration' has not been declared Blended.moc: In member function 'virtual void* Blended::BlendedClient::qt_cast(const char*)': Blended.moc:78: error: 'KDecoration' has not been declared Blended.moc: In member function 'virtual bool Blended::BlendedClient::qt_invoke(int, QUObject*)': Blended.moc:87: error: 'KDecoration' has not been declared Blended.moc: In member function 'virtual bool Blended::BlendedClient::qt_emit(int, QUObject*)': Blended.moc:94: error: 'KDecoration' has not been declared Blended.moc: In member function 'virtual bool Blended::BlendedClient::qt_property(int, int, QVariant*)': Blended.moc:100: error: 'KDecoration' has not been declared B
make[3]: Verlasse Verzeichnis '/tmp/kompile-tmp/Blended-0.3/kwin'
lended.cpp: In member function 'void Blended::BlendedHandler::createPixmaps(bool)': Blended.cpp:97: error: 'options' was not declared in this scope Blended.cpp:98: error: 'BorderLarge' was not declared in this scope Blended.cpp:102: error: 'BorderVeryLarge' was not declared in this scope Blended.cpp:106: error: 'BorderTiny' was not declared in this scope Blended.cpp:107: error: 'BorderNormal' was not declared in this scope Blended.cpp:113: error: 'options' was not declared in this scope Blended.cpp:121: error: 'KDecoration' has not been declared Blended.cpp:121: error: 'ColorTitleBar' was not declared in this scope Blended.cpp:122: error: 'KDecoration' has not been declared Blended.cpp:122: error: 'ColorTitleBlend' was not declared in this scope Blended.cpp:149: error: 'KDecoration' has not been declared Blended.cpp:150: error: 'KDecoration' has not been declared Blended.cpp: In member function 'QPixmap* Blended::BlendedHandler::loadPixmap(const QString&, bool)': Blended.cpp:603: error: 'KDecoration' has not
make[2]: Verlasse Verzeichnis '/tmp/kompile-tmp/Blended-0.3/kwin'
been declared Blended.cpp:603: error: 'ColorTitleBar' was not declared in this scope Blended.cpp:604: error: 'KDecoration' has not been declared Blended.cpp:604: error: 'ColorTitleBlend' was not declared in this scope Blended.cpp:605: error: 'KDecoration' has not been declared Blended.cpp:606: error: 'KDecoration' has not been declared Blended.cpp:604: warning: unused variable 'activeBlendColor' Blended.cpp:606: warning: unused variable 'inactiveBlendColor' Blended.cpp: In member function 'virtual bool Blended::BlendedHandler::reset(long unsigned int)': Blended.cpp:625: error: 'SettingBorder' was not declared in this scope Blended.cpp:629: error: 'SettingFont' was not declared in this scope Blended.cpp:634: error: 'SettingColors' was not declared in this scope Blended.cpp:639: error: 'SettingButtons' was not declared in this scope Blended.cpp:643: error: 'SettingTooltips' was not declared in this scope Blended.cpp:663: error: 'resetDecorations' was not declared in this scope Blended.cpp: At global scope: Blen
make[1]: Verlasse Verzeichnis '/tmp/kompile-tmp/Blended-0.3'
ded.cpp:735: error: expected constructor, destructor, or type conversion before '*' token Blended.cpp:740: error: 'BorderSize' is not a member of 'Blended::BlendedHandler' Blended.cpp:740: error: 'BorderSize' is not a member of 'Blended::BlendedHandler' Blended.cpp:740: error: template argument 1 is invalid Blended.cpp: In member function 'virtual int Blended::BlendedHandler::borderSizes() const': Blended.cpp:743: error: 'BorderSize' was not declared in this scope Blended.cpp:743: error: template argument 1 is invalid Blended.cpp:743: error: 'BorderNormal' was not declared in this scope Blended.cpp:743: error: 'BorderLarge' was not declared in this scope Blended.cpp:743: error: 'BorderVeryLarge' was not declared in this scope Blended.cpp: In constructor 'Blended::BlendedButton::BlendedButton(Blended::BlendedClient*, const char*, Blended::Button, const QString&, bool, int)': Blended.cpp:747: error: 'class Blended::BlendedClient' has no member named 'widget' Blended.cpp:762: error: 'class Blended::BlendedClient
' has no member named 'isActive' Blended.cpp:763: error: 'class Blended::BlendedClient' has no member named 'isActive' Blended.cpp: At global scope: Blended.cpp:747: warning: unused parameter 'bttstate' Blended.cpp: In member function 'virtual void Blended::BlendedButton::drawButton(QPainter*)': Blended.cpp:814: error: 'class Blended::BlendedClient' has no member named 'isActive' Blended.cpp:816: error: 'class Blended::BlendedClient' has no member named 'isActive' Blended.cpp:870: error: 'class Blended::BlendedClient' has no member named 'isActive' Blended.cpp:874: error: 'class Blended::BlendedClient' has no member named 'isActive' Blended.cpp:878: error: 'class Blended::BlendedClient' has no member named 'maximizeMode' Blended.cpp:879: error: 'MaximizeFull' is not a member of 'Blended::BlendedClient' Blended.cpp:882: error: 'class Blended::BlendedClient' has no member named 'isActive' Blended.cpp:886: error: 'class Blended::BlendedClient' has no member named 'isActive' Blended.cpp: At global scope: Blended.
cpp:993: error: expected `)' before '*' token Blended.cpp: In member function 'virtual void Blended::BlendedClient::init()': Blended.cpp:1015: error: 'WStaticContents' was not declared in this scope Blended.cpp:1015: error: 'WNoAutoErase' was not declared in this scope Blended.cpp:1015: error: 'createMainWidget' was not declared in this scope Blended.cpp:1016: error: 'widget' was not declared in this scope Blended.cpp: In member function 'void Blended::BlendedClient::createLayout()': Blended.cpp:1043: error: 'widget' was not declared in this scope Blended.cpp:1058: error: 'isActive' was not declared in this scope Blended.cpp:1086: error: 'options' was not declared in this scope Blended.cpp:1131: error: 'isPreview' was not declared in this scope Blended.cpp: In member function 'virtual void Blended::BlendedClient::reset(long unsigned int)': Blended.cpp:1152: error: 'widget' was not declared in this scope Blended.cpp: In member function 'void Blended::BlendedClient::addButtons(QBoxLayout*, const QString&)': Ble
nded.cpp:1197: error: 'LeftButton' was not declared in this scope Blended.cpp:1197: error: 'MidButton' was not declared in this scope Blended.cpp:1197: error: 'RightButton' was not declared in this scope Blended.cpp:1203: error: 'isMinimizable' was not declared in this scope Blended.cpp:1207: error: 'connect' was not declared in this scope Blended.cpp:1222: error: 'isMaximizable' was not declared in this scope Blended.cpp:1226: error: 'connect' was not declared in this scope Blended.cpp:1241: error: 'isCloseable' was not declared in this scope Blended.cpp:1245: error: 'connect' was not declared in this scope Blended.cpp:1264: error: 'providesContextHelp' was not declared in this scope Blended.cpp:1267: error: 'connect' was not declared in this scope Blended.cpp: In member function 'void Blended::BlendedClient::updateMask()': Blended.cpp:1331: error: 'setMask' was not declared in this scope Blended.cpp: In member function 'virtual void Blended::BlendedClient::captionChange()': Blended.cpp:1339: error: 'widget'
was not declared in this scope Blended.cpp:1339: error: 'isActive' was not declared in this scope Blended.cpp: In member function 'void Blended::BlendedClient::iconChange()': Blended.cpp:1385: error: 'widget' was not declared in this scope Blended.cpp:1385: error: 'isActive' was not declared in this scope Blended.cpp: In member function 'void Blended::BlendedClient::drawAppIcon(QPainter&)': Blended.cpp:1399: error: 'isActive' was not declared in this scope Blended.cpp:1401: error: 'class Blended::BlendedClient' has no member named 'icon' Blended.cpp:1401: error: incomplete type 'QIconSet' used in nested name specifier Blended.cpp:1401: error: incomplete type 'QIconSet' used in nested name specifier Blended.cpp:1405: error: 'class Blended::BlendedClient' has no member named 'icon' Blended.cpp:1405: error: incomplete type 'QIconSet' used in nested name specifier Blended.cpp:1405: error: incomplete type 'QIconSet' used in nested name specifier Blended.cpp:1440: error: 'isActive' was not declared in this scope B
lended.cpp: In member function 'void Blended::BlendedClient::drawCaptionText(QPainter&)': Blended.cpp:1456: error: 'class Blended::BlendedHandler' has no member named 'options' Blended.cpp:1456: error: 'isActive' was not declared in this scope Blended.cpp:1460: error: 'AlignLeft' was not declared in this scope Blended.cpp:1460: error: 'AlignVCenter' was not declared in this scope Blended.cpp:1460: error: 'SingleLine' was not declared in this scope Blended.cpp:1463: error: 'AlignCenter' was not declared in this scope Blended.cpp:1466: error: 'AlignRight' was not declared in this scope Blended.cpp:1510: error: 'caption' was not declared in this scope Blended.cpp:1526: error: 'options' was not declared in this scope Blended.cpp:1526: error: 'ColorFont' was not declared in this scope Blended.cpp:1551: error: 'caption' was not declared in this scope Blended.cpp: In member function 'void Blended::BlendedClient::drawTitlebar(QPainter&, QRect&)': Blended.cpp:1565: error: 'isActive' was not declared in this scope Blen
ded.cpp:1594: error: 'isActive' was not declared in this scope Blended.cpp: In member function 'void Blended::BlendedClient::drawFrame(QPainter&, QRect&, QPaintEvent*)': Blended.cpp:1628: error: 'isActive' was not declared in this scope Blended.cpp: In member function 'int Blended::BlendedClient::BttWidthOnLeft()': Blended.cpp:1719: error: 'options' was not declared in this scope Blended.cpp:1760: error: 'isMinimizable' was not declared in this scope Blended.cpp:1762: error: 'isActive' was not declared in this scope Blended.cpp:1764: error: 'isMaximizable' was not declared in this scope Blended.cpp:1766: error: 'isActive' was not declared in this scope Blended.cpp:1768: error: 'isCloseable' was not declared in this scope Blended.cpp:1770: error: 'isActive' was not declared in this scope Blended.cpp:1773: error: 'providesContextHelp' was not declared in this scope Blended.cpp:1775: error: 'isActive' was not declared in this scope Blended.cpp:1799: error: 'isActive' was not declared in this scope Blended.cpp: I
n member function 'int Blended::BlendedClient::BttWidthOnRight()': Blended.cpp:1807: error: 'options' was not declared in this scope Blended.cpp:1848: error: 'isMinimizable' was not declared in this scope Blended.cpp:1850: error: 'isActive' was not declared in this scope Blended.cpp:1853: error: 'isMaximizable' was not declared in this scope Blended.cpp:1855: error: 'isActive' was not declared in this scope Blended.cpp:1858: error: 'isCloseable' was not declared in this scope Blended.cpp:1860: error: 'isActive' was not declared in this scope Blended.cpp:1863: error: 'providesContextHelp' was not declared in this scope Blended.cpp:1865: error: 'isActive' was not declared in this scope Blended.cpp:1895: error: 'isActive' was not declared in this scope Blended.cpp: In member function 'virtual void Blended::BlendedClient::activeChange()': Blended.cpp:1908: error: 'widget' was not declared in this scope Blended.cpp: In member function 'virtual void Blended::BlendedClient::maximizeChange()': Blended.cpp:1926: error
: 'maximizeMode' was not declared in this scope Blended.cpp:1926: error: 'MaximizeFull' was not declared in this scope Blended.cpp:1929: error: 'widget' was not declared in this scope Blended.cpp: In member function 'void Blended::BlendedClient::slotMaximize()': Blended.cpp:1962: error: 'MidButton' was not declared in this scope Blended.cpp:1963: error: 'maximizeMode' was not declared in this scope Blended.cpp:1963: error: 'MaximizeVertical' was not declared in this scope Blended.cpp:1963: error: 'maximize' was not declared in this scope Blended.cpp:1966: error: 'RightButton' was not declared in this scope Blended.cpp:1967: error: 'MaximizeHorizontal' was not declared in this scope Blended.cpp:1970: error: 'LeftButton' was not declared in this scope Blended.cpp:1971: error: 'MaximizeFull' was not declared in this scope Blended.cpp:1971: error: 'MaximizeRestore' was not declared in this scope Blended.cpp: In member function 'void Blended::BlendedClient::paintEvent(QPaintEvent*)': Blended.cpp:2010: error: 'widg
et' was not declared in this scope Blended.cpp: In member function 'void Blended::BlendedClient::resizeEvent(QResizeEvent*)': Blended.cpp:2029: error: 'widget' was not declared in this scope Blended.cpp:2054: error: no matching function for call to 'QApplication::postEvent(Blended::BlendedClient* const, QPaintEvent*)' /usr/share/qt3/include/qapplication.h:154: note: candidates are: static void QApplication::postEvent(QObject*, QEvent*) Blended.cpp: In member function 'void Blended::BlendedClient::mouseDoubleClickEvent(QMouseEvent*)': Blended.cpp:2062: error: 'titlebarDblClickOperation' was not declared in this scope Blended.cpp: At global scope: Blended.cpp:2066: error: 'Position' in class 'Blended::BlendedClient' does not name a type Blended.cpp: In member function 'virtual void Blended::BlendedClient::resize(const QSize&)': Blended.cpp:2143: error: 'widget' was not declared in this scope Blended.cpp: In member function 'virtual void Blended::BlendedClient::borders(int&, int&, int&, int&) const': Blended.cpp
:2151: error: 'isActive' was not declared in this scope Blended.cpp:2159: error: 'maximizeMode' was not declared in this scope Blended.cpp:2159: error: 'MaximizeHorizontal' was not declared in this scope Blended.cpp:2159: error: 'options' was not declared in this scope Blended.cpp:2161: error: 'maximizeMode' was not declared in this scope Blended.cpp:2161: error: 'MaximizeVertical' was not declared in this scope Blended.cpp:2163: error: 'options' was not declared in this scope Blended.cpp: In member function 'virtual QSize Blended::BlendedClient::minimumSize() const': Blended.cpp:2170: error: 'widget' was not declared in this scope Blended.cpp: In member function 'virtual bool Blended::BlendedClient::eventFilter(QObject*, QEvent*)': Blended.cpp:2175: error: 'widget' was not declared in this scope Blended.cpp:2192: error: 'processMousePressEvent' was not declared in this scope Blended.cpp: At global scope: Blended.cpp:2203: error: expected constructor, destructor, or type conversion before '*' token
make[3]: *** [Blended.lo] Fehler 1
make[2]: *** [all-recursive] Fehler 1
make[1]: *** [all-recursive] Fehler 1
make: *** [all] Fehler 2
Error during sources build. Installation aborted!
----------

what's the reason? =( - Sep 07 2007
Pureline

KDE 3.x Window Decorations 45 comments

Score 50.0%
Oct 24 2005
please re-up! - Sep 07 2007
K4 Theme Package

Various KDE 1.-4. Styles 41 comments

Score 53.3%
Nov 04 2007
nice package, please re-up the color sheme.

"Forbidden

You don't have permission to access /oxygen_kde_dark.kcsrc on this server." - Sep 06 2007
Simple monitor

Plasma 4 Widgets
by ndubuit

Score 53.3%
Aug 07 2010
Score 86.8%
9   Oct 28 2017
Whoa that's nice, thanks!
Simple monitor

Plasma 4 Widgets
by ndubuit

Score 53.3%
9   Jan 17 2011