Image 01
profile-image

ivantodorovich

Iv├ín Todorovich , Argentina
test
QIrExpander

Qt Widgets 6 comments

Score 50.0%
Nov 13 2009
Actually, I'm having problems compiling QIron plugins. I'm getting the following errors:

...................
..\..\QIron-0.1\src\Common\qirobject.cpp:29: error: aggregate 'QIron::QIrObjectList QIron::QIrObjectPrivate::allObjects' has incomplete type and cannot be defined

..\..\QIron-0.1\src\Common\qirobject.cpp: In static member function 'static QIron::QIrObjectList QIron::QIrObject::allObjects(const QString&)':

..\..\QIron-0.1\src\Common\qirobject.cpp:68: error: return type 'struct QIron::QIrObjectList' is incomplete

..\..\QIron-0.1\src\Common\qirobject.cpp:71: error: aggregate 'QIron::QIrObjectList list' has incomplete type and cannot be defined

..\..\QIron-0.1\src\Common\qirobject.cpp:75: error: template argument 1 is invalid

..\..\QIron-0.1\src\Common\qirobject.cpp:75: error: invalid type in declaration before '(' token

..\..\QIron-0.1\src\Common\qirobject.cpp:75: error: request for member 'brk' in '_container_', which is of non-class type 'int'

..\..\QIron-0.1\src\Common\qirobject.cpp:75: error: request for member 'i' in '_container_', which is of non-class type 'int'

..\..\QIron-0.1\src\Common\qirobject.cpp:75: error: request for member 'e' in '_container_', which is of non-class type 'int'

..\..\QIron-0.1\src\Common\qirobject.cpp:75: error: request for member 'brk' in '_container_', which is of non-class type 'int'

..\..\QIron-0.1\src\Common\qirobject.cpp:75: error: request for member 'i' in '_container_', which is of non-class type 'int'

..\..\QIron-0.1\src\Common\qirobject.cpp:75: error: request for member 'i' in '_container_', which is of non-class type 'int'

..\..\QIron-0.1\src\Common\qirobject.cpp:75: error: request for member 'brk' in '_container_', which is of non-class type 'int'

mingw32-make[2]: *** [release/qirobject.o] Error 1

mingw32-make[1]: *** [release] Error 2

mingw32-make: *** [sub-src-make_default-ordered] Error 2

The process "C:/Qt/QtCreator-2.0.1/mingw/bin/mingw32-make.exe" exited with code %2.
Error while building project qiron (target: Desktop)
When executing build step 'Make'

..................... - Jan 14 2011
Hi,

Is it possible to make it look like this on Windows Vista + ?

http://www.qiuhao.com/UploadFile/2008-6/2008613982892218.jpg

Maybe subclassing QVistaStyle? - Jan 14 2011