Image 01
profile-image

gobonja

stipe celendra
test
Smooth Tasks

Plasma 4 Extensions 842 comments

by panzi
Score 86.9%
Nov 05 2010
I think it's kde's problem. It crashes after adding some some preinstalled widgets. - Jan 28 2010
I installed successfully Smooth Tasks on Kubuntu 9.10 with KDE 4.4 RC2 but plasma workspace crashes when adding Smooth Task widget.
Does anyone have same problem? - Jan 27 2010
Talika applet

Various Gnome Stuff 114 comments

Score 73.1%
Sep 01 2010
This applet is great.
I have a suggestion. Add closing opened windows with a middle click. - Jan 17 2010
kffmpegthumbnailer

Video Apps 56 comments

Score 58.0%
Jan 07 2010
How do I install ffmpegthumbnailer-2.0.0? I downloaded tar.gz from http://code.google.com/p/ffmpegthumbnailer/downloads/detail?name=ffmpegthumbnailer-2.0.0.tar.gz - Jan 08 2010
It works now. Is this older version of kffmpegthumbnailer? - Jan 08 2010
Command line cmake . -DCMAKE_INSTALL_PREFIX=`kde4-config --prefix` works now. Command make has these error:

[ 50%] Built target kffmpegthumbnailer_automoc
[ 50%] Building CXX object CMakeFiles/kffmpegthumbnailer.dir/kffmpegthumbnailer_automoc.o
In file included from /home/marko/Desktop/kffmpegthumbnailer-1.1.0/moc_kffmpegthumbnailer.cpp:10,
from /home/marko/Desktop/kffmpegthumbnailer-1.1.0/kffmpegthumbnailer_automoc.cpp:4:
/home/marko/Desktop/kffmpegthumbnailer-1.1.0/kffmpegthumbnailer.h:23:51: error: libffmpegthumbnailer/videothumbnailer.h: No such file or directory
/home/marko/Desktop/kffmpegthumbnailer-1.1.0/kffmpegthumbnailer.h:24:50: error: libffmpegthumbnailer/filmstripfilter.h: No such file or directory
In file included from /home/marko/Desktop/kffmpegthumbnailer-1.1.0/moc_kffmpegthumbnailer.cpp:10,
from /home/marko/Desktop/kffmpegthumbnailer-1.1.0/kffmpegthumbnailer_automoc.cpp:4:
/home/marko/Desktop/kffmpegthumbnailer-1.1.0/kffmpegthumbnailer.h:36: error: ‘ffmpegthumbnailer’ has not been declared
/home/marko/Desktop/kffmpegthumbnailer-1.1.0/kffmpegthumbnailer.h:36: error: ISO C++ forbids declaration of ‘VideoThumbnailer’ with no type
/home/marko/Desktop/kffmpegthumbnailer-1.1.0/kffmpegthumbnailer.h:36: error: expected ‘;’ before ‘m_Thumbnailer’
/home/marko/Desktop/kffmpegthumbnailer-1.1.0/kffmpegthumbnailer.h:37: error: ‘ffmpegthumbnailer’ has not been declared
/home/marko/Desktop/kffmpegthumbnailer-1.1.0/kffmpegthumbnailer.h:37: error: ISO C++ forbids declaration of ‘FilmStripFilter’ with no type
/home/marko/Desktop/kffmpegthumbnailer-1.1.0/kffmpegthumbnailer.h:37: error: expected ‘;’ before ‘m_FilmStrip’
make[2]: *** [CMakeFiles/kffmpegthumbnailer.dir/kffmpegthumbnailer_automoc.o] Error 1
make[1]: *** [CMakeFiles/kffmpegthumbnailer.dir/all] Error 2
make: *** [all] Error 2 - Jan 08 2010
Doesn't work. But error message is now different:

-- The C compiler identification is GNU
-- The CXX compiler identification is GNU
-- Check for working C compiler: /usr/bin/gcc
-- Check for working C compiler: /usr/bin/gcc -- works
-- Detecting C compiler ABI info
-- Detecting C compiler ABI info - done
-- Check for working CXX compiler: /usr/bin/c++
-- Check for working CXX compiler: /usr/bin/c++ -- works
-- Detecting CXX compiler ABI info
-- Detecting CXX compiler ABI info - done
CMake Error at /usr/share/cmake-2.6/Modules/FindKDE4.cmake:84 (MESSAGE):
ERROR: cmake/modules/FindKDE4Internal.cmake not found in
/home/marko/.kde/share/apps;/usr/share/kubuntu-default-settings/kde4-profile/default/share/apps;/usr/share/kde4/apps
Call Stack (most recent call first):
CMakeLists.txt:3 (find_package)


CMake Warning (dev) in CMakeLists.txt:
No cmake_minimum_required command is present. A line of code such as

cmake_minimum_required(VERSION 2.6)

should be added at the top of the file. The version specified may be lower
if you wish to support older CMake versions for this project. For more
information run "cmake --help-policy CMP0000".
This warning is for project developers. Use -Wno-dev to suppress it.

-- Configuring incomplete, errors occurred! - Jan 08 2010
I tried installing kffmpegthumbnailer as explained in INSTALL file. I am using Kubuntu 9.10, KDE 4.4.
I get this error message:

-- The CXX compiler identification is unknown
CMake Error: your CXX compiler: "CMAKE_CXX_COMPILER-NOTFOUND" was not found. Please set CMAKE_CXX_COMPILER to a valid compiler path or name.
CMake Error at /usr/share/cmake-2.6/Modules/FindKDE4.cmake:84 (MESSAGE):
ERROR: cmake/modules/FindKDE4Internal.cmake not found in
/home/marko/.kde/share/apps;/usr/share/kubuntu-default-settings/kde4-profile/default/share/apps;/usr/share/kde4/apps
Call Stack (most recent call first):
CMakeLists.txt:3 (find_package)


CMake Warning (dev) in CMakeLists.txt:
No cmake_minimum_required command is present. A line of code such as

cmake_minimum_required(VERSION 2.6)

should be added at the top of the file. The version specified may be lower
if you wish to support older CMake versions for this project. For more
information run "cmake --help-policy CMP0000".
This warning is for project developers. Use -Wno-dev to suppress it.

-- Configuring incomplete, errors occurred! - Jan 08 2010