Image 01
profile-image

Diestelhenne

Diestel Henne
test
Weather Plasmoid

Plasma 4 Extensions 127 comments

Score 50.0%
Jul 10 2008
Could you please use another hoster? There seem to be problems with direct links to the file (such as: http://download83.mediafire.com/t3h2uxsuuydg/zsj2dxxj2sl/plasma-weather-0.4.tar.gz). They seem to change from time to time. - Aug 07 2008
I made an Archlinux package availaible via AUR:http://aur.archlinux.org/packages.php?ID=18819

Enjoy! - Aug 02 2008
Email Notify

Plasma 4 Extensions 68 comments

Score 58.0%
May 11 2008
[ 45%] Building CXX object CMakeFiles/plasma_applet_emailnotify.dir/plasma-emailnotify.o
In file included from /home/arch/Desktop/email-notify-plasmoid/src/emailnotify/plasma-emailnotify.h:30,
from /home/arch/Desktop/email-notify-plasmoid/src/emailnotify/plasma-emailnotify.cpp:21:
/usr/include/kdialog.h:803: Warnung: »virtual void KDialog::slotButtonClicked(int)« war versteckt
/home/arch/Desktop/email-notify-plasmoid/src/emailnotify/settings/configdialog.h:50: Warnung: von »void ConfigDialog::slotButtonClicked(KDialog::ButtonCode)«
/home/arch/Desktop/email-notify-plasmoid/src/emailnotify/plasma-emailnotify.cpp: In constructor »EmailNotify::EmailNotify(QObject*, const QVariantList&)«:
/home/arch/Desktop/email-notify-plasmoid/src/emailnotify/plasma-emailnotify.cpp:42: Fehler: »setDrawStandardBackground« wurde in diesem Gültigkeitsbereich nicht definiert
/home/arch/Desktop/email-notify-plasmoid/src/emailnotify/plasma-emailnotify.cpp:43: Fehler: »setSize« wurde in diesem Gültigkeitsbereich nicht definiert
/home/arch/Desktop/email-notify-plasmoid/src/emailnotify/plasma-emailnotify.cpp: Indestructor »virtual EmailNotify::~EmailNotify()«:
/home/arch/Desktop/email-notify-plasmoid/src/emailnotify/plasma-emailnotify.cpp:60:Fehler: »failedToLaunch« wurde in diesem Gültigkeitsbereich nicht definiert
/home/arch/Desktop/email-notify-plasmoid/src/emailnotify/plasma-emailnotify.cpp: Inmember function »virtual void EmailNotify::paintInterface(QPainter*, const QStyleOptionGraphicsItem*, const QRect&)«:
/home/arch/Desktop/email-notify-plasmoid/src/emailnotify/plasma-emailnotify.cpp:242: Fehler: »setMaximumContentSize« wurde in diesem Gültigkeitsbereich nicht definiert
/home/arch/Desktop/email-notify-plasmoid/src/emailnotify/plasma-emailnotify.cpp: Atglobal scope:
/home/arch/Desktop/email-notify-plasmoid/src/emailnotify/plasma-emailnotify.cpp:300: Warnung: unbenutzter Parameter »constraints«
make[2]: *** [CMakeFiles/plasma_applet_emailnotify.dir/plasma-emailnotify.o] Fehler1
make[1]: *** [CMakeFiles/plasma_applet_emailnotify.dir/all] Fehler 2
make: *** [all] Fehler 2
==> FEHLER: Build fehlgeschlagen.
Breche ab ... - Aug 03 2008
Qalculate

Plasma 4 Extensions 88 comments

Score 63.3%
Oct 22 2009
I made an Archlinux package availaible via AUR: http://aur.archlinux.org/packages.php?ID=18836

Enjoy! - Aug 02 2008
OPAK for KWin

KDE 3.x Window Decorations 11 comments

Score 50.0%
Sep 27 2007
I made an Archlinux package named "kdedecor-opak". It's availaible via AUR.

http://aur.archlinux.org/packages.php?ID=17550 - Jun 14 2008