Image 01
profile-image

dfaisant

denis FAISANT
test
Kogs

Screensavers 7 comments

by dfn5
Score 50.0%
Dec 05 2002
When I install Kogs, at level in make:

[root@localhost kogs-1.1.0]# make
make all-recursive
make[1]: Entering directory `/usr/src/KOGS/kogs-1.1.0'
Making all in kogs
make[2]: Entering directory `/usr/src/KOGS/kogs-1.1.0/kogs'
if g++ -DHAVE_CONFIG_H -I. -I. -I.. -I/usr/lib/qt3/include -I/usr/X11R6/include -DQT_THREAD_SUPPORT -D_REENTRANT -Wnon-virtual-dtor -Wno-long-long -Wundef -Wall -pedantic -W -Wpointer-arith -Wmissing-prototypes -Wwrite-strings -ansi -D_XOPEN_SOURCE=500 -D_BSD_SOURCE -Wcast-align -Wconversion -O2 -fno-exceptions -fno-check-new -MT main.o -MD -MP -MF ".deps/main.Tpo" \
-c -o main.o `test -f 'main.cc' || echo './'`main.cc; \
then mv ".deps/main.Tpo" ".deps/main.Po"; \
else rm -f ".deps/main.Tpo"; exit 1; \
fi
In file included from kogwidget.h:7,
from kogs.h:7,
from main.cc:8:
/usr/lib/qt3/include/qgl.h:78:21: GL/glu.h: No such file or directory
make[2]: *** [main.o] Erreur 1
make[2]: Leaving directory `/usr/src/KOGS/kogs-1.1.0/kogs'
make[1]: *** [all-recursive] Erreur 1
make[1]: Leaving directory `/usr/src/KOGS/kogs-1.1.0'
make: *** [all] Erreur 2
[root@localhost kogs-1.1.0]#

Like you can see, I have an error of compilation, I use Mandrake Linux 9.1 (based on RedHat Linux). Thank you for help me. - Feb 13 2004