Image 01
profile-image

crazy

Gabriel C , Germany
KNetDockApp

Network 109 comments

by yodor
Rating: 7.2
Jul 11 2008


Same error but maybe you are using older kernel headers ?

Also I'm using 2.6.21 kernel headers and so far I see from asm/types.h ( which you include in
knetdockif.h:25 )

....

#if defined(__GNUC__) && !defined(__STRICT_ANSI__)
typedef __signed__ long long __s64;
typedef unsigned long long __u64;
#endif

....

So is really the ansi stuff .. - Jun 21 2007
Hi,

Does not build for me, here the error:

check-new -fno-common -fexceptions -c -o addresspane.o addresspane.cpp
In file included from /usr/include/linux/rtnetlink.h:5,
from knetdockif.h:33,
from addresspane.h:27,
from addresspane.cpp:20:
/usr/include/linux/if_link.h:43: error: '__u64' does not name a type
/usr/include/linux/if_link.h:44: error: '__u64' does not name a type
/usr/include/linux/if_link.h:45: error: '__u64' does not name a type
In file included from /usr/include/linux/rtnetlink.h:7,
from knetdockif.h:33,
from addresspane.h:27,
from addresspane.cpp:20:
/usr/include/linux/neighbour.h:92: error: '__u64' does not name a type
/usr/include/linux/neighbour.h:93: error: '__u64' does not name a type
/usr/include/linux/neighbour.h:94: error: '__u64' does not name a type
/usr/include/linux/neighbour.h:95: error: '__u64' does not name a type
/usr/include/linux/neighbour.h:96: error: '__u64' does not name a type
/usr/include/linux/neighbour.h:97: error: '__u64' does not name a type
/usr/include/linux/neighbour.h:98: error: '__u64' does not name a type
/usr/include/linux/neighbour.h:99: error: '__u64' does not name a type
/usr/include/linux/neighbour.h:100: error: '__u64' does not name a type
/usr/include/linux/neighbour.h:101: error: '__u64' does not name a type
make[2]: *** [addresspane.o] Error 1
make[2]: Leaving directory `/var/tmp/fst/src/knetdockapp-0.71/src'
make[1]: *** [all-recursive] Error 1
make[1]: Leaving directory `/var/tmp/fst/src/knetdockapp-0.71'
make: *** [all] Error 2

Regards,

Gabriel - Jun 18 2007
Hi,

0.61 works:)
Ty for fixing the error that quick :) - Oct 13 2005
Hi,
0.6 looks like is broken can't compile it.Version 0.1 to 0.4 were fine ,0.5 not compiled so I dont know it was broken or not.
(Kde3.5 beta1 / qt 3.3.5 / gcc 4.0.2 on Frugalware)

error 1 with --disable-dependency-tracking --enable-final option :

creating knetdockapp.all_cpp.cpp ...
g++ -DHAVE_CONFIG_H -I. -I. -I.. -I/usr/lib/qt/include -I/usr/X11R6/include -DQT_THREAD_SUPPORT -D_REENTRANT -Wnon-virtual-dtor -Wno-long-long -Wundef -Wall -W -Wpointer-arith -Wwrite-strings -ansi -D_XOPEN_SOURCE=500 -D_BSD_SOURCE -Wcast-align -Wconversion -Wchar-subscripts -O2 -march=i686 -O2 -pipe -Wformat-security -Wmissing-format-attribute -fno-exceptions -fno-check-new -fno-common -c -o knetdockapp.all_cpp.o knetdockapp.all_cpp.cpp
mydock.cpp: In member function 'bool mydock::queryDevices()':
mydock.cpp:214: warning: comparison between signed and unsigned integer expressions
mydock.cpp: In member function 'void mydock::update()':
mydock.cpp:406: warning: comparison between signed and unsigned integer expressions
mydock.cpp: In member function 'int mydock::readSock(int, char*, int, int)':
mydock.cpp:482: warning: comparison between signed and unsigned integer expressions
mydock.cpp:501: warning: comparison between signed and unsigned integer expressions
mydock.cpp:501: warning: comparison between signed and unsigned integer expressions
netsettingsdialog.cpp: At global scope:
netsettingsdialog.cpp:139: warning: unused parameter 'o'
netsettingsdialog.cpp:139: warning: unused parameter 'e'
chartframe.cpp: In destructor 'virtual ChartFrame::~ChartFrame()':
chartframe.cpp:29: error: 'free' was not declared in this scope
chartframe.cpp: In member function 'void ChartFrame::init()':
chartframe.cpp:35: error: 'malloc' was not declared in this scope
chartframe.cpp: At global scope:
chartframe.cpp:58: warning: unused parameter 'e'
{standard input}: Assembler messages:
{standard input}:1425: Error: Local symbol `.LTHUNK0' can't be equated to undefined symbol `_ZN11KNetDockAppD1Ev'
{standard input}:1425: Error: Local symbol `.LTHUNK1' can't be equated to undefined symbol `_ZN11KNetDockAppD1Ev'
{standard input}:1425: Error: Local symbol `.LTHUNK2' can't be equated to undefined symbol `_ZN11KNetDockAppD0Ev'
{standard input}:1425: Error: Local symbol `.LTHUNK3' can't be equated to undefined symbol `_ZN11KNetDockAppD0Ev'
{standard input}:1425: Error: Local symbol `.LTHUNK4' can't be equated to undefined symbol `_ZN10ChartFrameD1Ev'
{standard input}:1425: Error: Local symbol `.LTHUNK5' can't be equated to undefined symbol `_ZN10ChartFrameD0Ev'
{standard input}:1425: Error: Local symbol `.LTHUNK6' can't be equated to undefined symbol `_ZN17NetSettingsDialogD0Ev'
{standard input}:1425: Error: Local symbol `.LTHUNK7' can't be equated to undefined symbol `_ZN17NetSettingsDialogD1Ev'
{standard input}:1425: Error: Local symbol `.LTHUNK8' can't be equated to undefined symbol `_ZN11NetSettingsD1Ev'
{standard input}:1425: Error: Local symbol `.LTHUNK9' can't be equated to undefined symbol `_ZN11NetSettingsD0Ev'
{standard input}:1425: Error: Local symbol `.LTHUNK10' can't be equated to undefined symbol `_ZN6mydockD1Ev'
{standard input}:1425: Error: Local symbol `.LTHUNK11' can't be equated to undefined symbol `_ZN6mydockD0Ev'
make[2]: *** [knetdockapp.all_cpp.o] Error 1
make[2]: Leaving directory `/KDE3.5-BUILDS/kde-extra/knetdockapp/src/knetdockapp-0.6/src'
make[1]: *** [all-recursive] Error 1
make[1]: Leaving directory `/KDE3.5-BUILDS/kde-extra/knetdockapp/src/knetdockapp-0.6'
make: *** [all] Error 2

error 2 whithout --enable-final :

-march=i686 -O2 -pipe -Wformat-security -Wmissing-format-attribute -fno-exceptions -fno-check-new -fno-common -c -o mydock.o mydock.cpp
mydock.cpp: In member function 'bool mydock::queryDevices()':
mydock.cpp:214: warning: comparison between signed and unsigned integer expressions
mydock.cpp: In member function 'void mydock::update()':
mydock.cpp:406: warning: comparison between signed and unsigned integer expressions
mydock.cpp: In member function 'int mydock::readSock(int, char*, int, int)':
mydock.cpp:482: warning: comparison between signed and unsigned integer expressions
mydock.cpp:501: warning: comparison between signed and unsigned integer expressions
mydock.cpp:501: warning: comparison between signed and unsigned integer expressions
/usr/lib/qt/bin/moc ./netsettingsdialog.h -o netsettingsdialog.moc
g++ -DHAVE_CONFIG_H -I. -I. -I.. -I/usr/lib/qt/include -I/usr/X11R6/include -DQT_THREAD_SUPPORT -D_REENTRANT -Wnon-virtual-dtor -Wno-long-long -Wundef -Wall -W -Wpointer-arith -Wwrite-strings -ansi -D_XOPEN_SOURCE=500 -D_BSD_SOURCE -Wcast-align -Wconversion -Wchar-subscripts -O2 -march=i686 -O2 -pipe -Wformat-security -Wmissing-format-attribute -fno-exceptions -fno-check-new -fno-common -c -o netsettingsdialog.o netsettingsdialog.cpp
netsettingsdialog.cpp:139: warning: unused parameter 'o'
netsettingsdialog.cpp:139: warning: unused parameter 'e'
g++ -DHAVE_CONFIG_H -I. -I. -I.. -I/usr/lib/qt/include -I/usr/X11R6/include -DQT_THREAD_SUPPORT -D_REENTRANT -Wnon-virtual-dtor -Wno-long-long -Wundef -Wall -W -Wpointer-arith -Wwrite-strings -ansi -D_XOPEN_SOURCE=500 -D_BSD_SOURCE -Wcast-align -Wconversion -Wchar-subscripts -O2 -march=i686 -O2 -pipe -Wformat-security -Wmissing-format-attribute -fno-exceptions -fno-check-new -fno-common -c -o chartframe.o chartframe.cpp
chartframe.cpp: In destructor 'virtual ChartFrame::~ChartFrame()':
chartframe.cpp:29: error: 'free' was not declared in this scope
chartframe.cpp: In member function 'void ChartFrame::init()':
chartframe.cpp:35: error: 'malloc' was not declared in this scope
chartframe.cpp: At global scope:
chartframe.cpp:58: warning: unused parameter 'e'
{standard input}: Assembler messages:
{standard input}:201: Error: Local symbol `.LTHUNK0' can't be equated to undefined symbol `_ZN10ChartFrameD1Ev'
{standard input}:201: Error: Local symbol `.LTHUNK1' can't be equated to undefined symbol `_ZN10ChartFrameD0Ev'
make[2]: *** [chartframe.o] Error 1
make[2]: Leaving directory `/KDE3.5-BUILDS/kde-extra/knetdockapp/src/knetdockapp-0.6/src'
make[1]: *** [all-recursive] Error 1
make[1]: Leaving directory `/KDE3.5-BUILDS/kde-extra/knetdockapp/src/knetdockapp-0.6'
make: *** [all] Error 2

Frugalware has knetdockapp now in the kde-extra repo, it will be good you can fix that :)

crazy - Oct 13 2005
Polar Theme - Preview 5

Icon Themes 44 comments

Rating: 7.0
Feb 23 2007
heh

Well I didn't got the time to figure what is wrong with the server but is slow only from outside Hu :|

( 17:56:02 (10.43 MB/s) - `Polar-Icons-Pre5.tar.gz' saved [1543674/1543674] )



uploaded in my home again

http://frugalware.org/~crazy/other/polar/Polar-Icons-Pre5.tar.gz

- Feb 24 2007
heh

Well I didn't got the time to figure what is wrong with the server but is slow only from outside Hu :|

( 17:56:02 (10.43 MB/s) - `Polar-Icons-Pre5.tar.gz' saved [1543674/1543674] )



uploaded in my home again

http://frugalware.org/~crazy/other/polar/Polar-Icons-Pre5.tar.gz

- Feb 24 2007
Sorry is a problem with our Server at the moment.
I've uploaded the tarball in my home for this release.

http://frugalware.org/~crazy/other/polar/ - Feb 14 2007
Hi,

If you still need an place to upload the icons pls drop me a email ( crazy@frugalware.org ) or poke me on IRC (freenode ,channel #frugalware ) about.

Sorry I don't use ICQ :) - Feb 12 2007
Sleek Mix

Icon Themes 6 comments

Rating: 5.5
Feb 11 2007
Hi,

Do you have *any* permission from Oxygen Team to do that ? do you ?

Did you *ever* read the Oxygen README file? I guess no ?

http://websvn.kde.org/trunk/playground/artwork/Oxygen/theme/README?rev=626698&view=markup


- Feb 10 2007
openSUSE

Various KDE Stuff 59 comments

Rating: 7.2
Dec 19 2008
Well this new menu is ugly ( for me ) but is not the issue anyway , the real issue ( and maybe you guys didn't noticed ) is / are _the GNOME depends ( eg: like half gnome
, mono and friends etc ) this thing _NEED_
to run_. A default _KDE_ installation pulls HALF GNOME !?! ( because beagle ? and this kickoff menu ?). This is for sure
a big issue for users _want KDE_ and NOT GNOME... - Dec 07 2006
gwenview

Graphic Apps 105 comments

by bk12
Rating: 7.1
Sep 17 2007
Hi,
what is this doublespinbox.h 'header' in filterbar.ui ? I can't see such a header file in the source .. and without it I get a compile error.I've just removed it and everything is ok again :) - Jul 14 2006
Tasty Menu

Various KDE 1.-4. Improvements 499 comments

by mart
Rating: 7.2
Dec 13 2007
Hi,

very nice program , like it a lot :). I've just pushed it to the Frugalware extra repo ;)
For Frugalware user using the 'current' tree pacman -Sy
tastymenu. - Jul 09 2006
Amarok

Audioplayers 574 comments

Rating: 7.3
Aug 01 2011
well
"* Multiple backends supported (GStreamer, xine, NMM, MAS, Helix and aRts)" kinda not true .. the _only_ free engine "does" work is 'xine' , you gusy killed everything else off.. so :
s/* Multiple backends supported (GStreamer, xine, NMM, MAS, Helix and aRts)/* Multiple backends supported (xine and Helix)/ . I really wonder why this release is called 'Fast Forward' ?! - May 17 2006
Konqueror Burning Sidebar

Utilities 60 comments

Rating: 7.1
Aug 10 2006
Hi,
"/i586-suse-linux/bin/ld: cannot find -lhal" this means hal | hal-devel is missig. Just install it and this error should go away :) - Apr 18 2006
KBFX Silk (KBFX 0.4.9.3.1)

Various KDE 1.-4. Improvements 613 comments

Rating: 6.6
Mar 05 2008
yes I can :) I just package it for frugalware an made a patch for it , there it is :

http://frugalware.org/~crazy/other/gcc41.patch

@ kbfx team
1)
class Baz {
....
Baz::something();
...
};

is a "error" with gcc41 the extra
"Baz::" need to go

2) mabye you don't know but KDE does _work_
with automake 1.9X - Apr 15 2006
yes I can :) I just package it for frugalware an made a patch for it , there it is :

http://frugalware.org/~crazy/other/gcc41.patch

@ kbfx team
1)
class Baz {
....
Baz::something();
...
};

is a "error" with gcc41 the extra
"Baz::" need to go

2) mabye you don't know but KDE does _work_
with automake 1.9X - Apr 15 2006
Kerry Beagle

Utilities 47 comments

Rating: 7.2
Dec 04 2006
you have to patch it to get bigger fonts ( I guess 11 will be a bit big for you but you can change it manually in the patch to what ever other size ):

ftp://frugalware.org/pub/frugalware/frugalware-current/extra/source/kde/kerry/font_size-8-is-bullshit.patch - Mar 23 2006
Linux MultiMedia Studio

Audio Apps 114 comments

Rating: 7.4
Nov 21 2007
Hi,

Looks like is broken with gcc4 ..
(gcc version 4.0.2 / qt 3.3.5 / KDE 3.5 )

io/audio_jack.cpp' || echo './'`./src/audio/audio_jack.cpp; \
then mv -f ".deps/audio_jack.Tpo" ".deps/audio_jack.Po"; else rm -f ".deps/audio_jack.Tpo"; exit 1; fi
./src/audio/audio_jack.cpp: In constructor 'audioJACK::audioJACK(Uint32, bool&)':
./src/audio/audio_jack.cpp:196: error: 'free' was not declared in this scope
make[2]: *** [audio_jack.o] Error 1
make[2]: Leaving directory `/home/crazy/broken/lmms-0.1.2'
make[1]: *** [all-recursive] Error 1
make[1]: Leaving directory `/home/crazy/broken/lmms-0.1.2'
make: *** [all] Error 2

next error if you try compile --without-jack

then mv -f ".deps/arp_and_chords_tab_widget.Tpo" ".deps/arp_and_chords_tab_widget.Po"; else rm -f ".deps/arp_and_chords_tab_widget.Tpo"; exit 1; fi
./src/core/arp_and_chords_tab_widget.cpp: In member function 'void arpAndChordsTabWidget::processNote(notePlayHandle*)':
./src/core/arp_and_chords_tab_widget.cpp:550: error: 'rand' was not declared in this scope
./src/core/arp_and_chords_tab_widget.cpp:551: error: 'RAND_MAX' was not declared in this scope
make[2]: *** [arp_and_chords_tab_widget.o] Error 1
make[2]: Leaving directory `/home/crazy/broken/lmms-0.1.2'
make[1]: *** [all-recursive] Error 1
make[1]: Leaving directory `/home/crazy/broken/lmms-0.1.2'
make: *** [all] Error 2 - Dec 24 2005
k9copy

Utilities 244 comments

Rating: 7.5
Apr 26 2011
Hi,

compile now but there are still lots of warnings.If you want I can mail you the build log or put it somewho online so mabye you can fix that in 1.0.1 :).

crazy

- Oct 17 2005
Hi,

I have problems compiling k9copy 1.0.0 with gcc 4.0.2 / kde 3.4.3 and qt 3.3.4

here the error :

g++ -DHAVE_CONFIG_H -I. -I. -I.. -I/usr/lib/qt/include -I/usr/X11R6/include -DQT_THREAD_SUPPORT -D_REENTRANT -O2 -g3 -Wnon-virtual-dtor -Wno-long-long -Wundef -Wall -W -Wpointer-arith -Wwrite-strings -ansi -D_XOPEN_SOURCE=500 -D_BSD_SOURCE -Wcast-align -Wconversion -Wchar-subscripts -O2 -march=i686 -O2 -pipe -Wformat-security -Wmissing-format-attribute -fno-exceptions -fno-check-new -fno-common -c -o kifo.o `test -f 'kifo.cpp' || echo './'`kifo.cpp
In file included from kifo.cpp:20:
kifo.h:81:7: warning: no newline at end of file
kifo.cpp:864:2: warning: no newline at end of file
/usr/lib/qt/include/private/qucom_p.h:69: warning: 'struct QUBuffer' has virtual functions but non-virtual destructor
/usr/lib/qt/include/private/qucom_p.h:77: warning: 'struct QUType' has virtual functions but non-virtual destructor
/usr/lib/qt/include/private/qucom_p.h:104: warning: 'struct QUType_Null' has virtual functions but non-virtual destructor
/usr/lib/qt/include/private/qucom_p.h:287: warning: 'struct QUType_enum' has virtual functions but non-virtual destructor
/usr/lib/qt/include/private/qucom_p.h:307: warning: 'struct QUType_ptr' has virtual functions but non-virtual destructor
/usr/lib/qt/include/private/qucom_p.h:326: warning: 'struct QUType_iface' has virtual functions but non-virtual destructor
/usr/lib/qt/include/private/qucom_p.h:345: warning: 'struct QUType_idisp' has virtual functions but non-virtual destructor
/usr/lib/qt/include/private/qucom_p.h:364: warning: 'struct QUType_bool' has virtual functions but non-virtual destructor
/usr/lib/qt/include/private/qucom_p.h:383: warning: 'struct QUType_int' has virtual functions but non-virtual destructor
/usr/lib/qt/include/private/qucom_p.h:403: warning: 'struct QUType_double' has virtual functions but non-virtual destructor
/usr/lib/qt/include/private/qucom_p.h:423: warning: 'struct QUType_charstar' has virtual functions but non-virtual destructor/usr/lib/qt/include/private/qucom_p.h:444: warning: 'struct QUType_QString' has virtual functions but non-virtual destructor
/usr/lib/qt/include/private/qucomextra_p.h:65: warning: 'struct QUType_QVariant' has virtual functions but non-virtual destructor
/usr/lib/qt/include/private/qucomextra_p.h:87: warning: 'struct QUType_varptr' has virtual functions but non-virtual destructor
kifo.cpp: In member function 'void kIFO::saveIFO()':
kifo.cpp:108: error: 'malloc' was not declared in this scope
kifo.cpp:114: error: 'free' was not declared in this scope
kifo.cpp:123: warning: comparison between signed and unsigned integer expressions
kifo.cpp:125: error: 'free' was not declared in this scope
kifo.cpp:207: error: 'free' was not declared in this scope
kifo.cpp: In member function 'void kIFO::updatePGC_CELL_PLAYBACK_TBL(uchar*, cell_playback_t*, int, int)':
kifo.cpp:353: error: 'malloc' was not declared in this scope
kifo.cpp:365: error: 'free' was not declared in this scope
kifo.cpp: In member function 'void kIFO::updatePGC_CELL_POSITION_TBL(uchar*, cell_position_t*, int, int)':
kifo.cpp:375: error: 'malloc' was not declared in this scope
kifo.cpp:381: error: 'free' was not declared in this scope
kifo.cpp: In member function 'void kIFO::updateTT_SRPT(uchar*)':
kifo.cpp:391: error: 'malloc' was not declared in this scope
kifo.cpp:408: error: 'free' was not declared in this scope
kifo.cpp: In member function 'void kIFO::updatePGCI_UT(uchar*)':
kifo.cpp:435: error: 'malloc' was not declared in this scope
kifo.cpp:445: error: 'free' was not declared in this scope
kifo.cpp:443: warning: unused variable 'info_length'
kifo.cpp: In member function 'void kIFO::updatePGCIT_internal(uchar*, pgcit_t*, int)':
kifo.cpp:482: error: 'malloc' was not declared in this scope
kifo.cpp:487: error: 'free' was not declared in this scope
kifo.cpp:489: warning: unused variable 'info_length'
kifo.cpp: In member function 'void kIFO::updatePTL_MAIT(uchar*)':
kifo.cpp:522: error: 'malloc' was not declared in this scope
kifo.cpp:531: error: 'free' was not declared in this scope
kifo.cpp:535: warning: unused variable 'info_length'
kifo.cpp: In member function 'void kIFO::updateVTS_ATRT(uchar*)':
kifo.cpp:575: error: 'malloc' was not declared in this scope
kifo.cpp:580: error: 'free' was not declared in this scope
kifo.cpp:599: warning: unused variable 'offset'
kifo.cpp: In member function 'void kIFO::updateC_ADT_Internal(uchar*, c_adt_t*, int)':
kifo.cpp:637: error: 'malloc' was not declared in this scope
kifo.cpp:642: error: 'free' was not declared in this scope
kifo.cpp:652: warning: comparison between signed and unsigned integer expressions
kifo.cpp: In member function 'void kIFO::updateVOBU_ADMAP_Internal(uchar*, vobu_admap_t*, int)':
kifo.cpp:691: error: 'malloc' was not declared in this scope
kifo.cpp:695: error: 'free' was not declared in this scope
kifo.cpp:704: warning: comparison between signed and unsigned integer expressions
kifo.cpp: In member function 'void kIFO::updateVTS(uchar*)':
kifo.cpp:714: error: 'malloc' was not declared in this scope
kifo.cpp:739: error: 'free' was not declared in this scope
kifo.cpp: In member function 'void kIFO::updateVTS_PTT_SRPT(uchar*)':
kifo.cpp:750: error: 'malloc' was not declared in this scope
kifo.cpp:758: error: 'free' was not declared in this scope
kifo.cpp: In member function 'void kIFO::updateVTS_TMAPT(uchar*)':
kifo.cpp:792: error: 'malloc' was not declared in this scope
kifo.cpp:835: error: 'free' was not declared in this scope
kifo.cpp:838: error: 'free' was not declared in this scope
kifo.cpp: In member function 'void kIFO::checkBuffer(QString, uchar*)':
kifo.cpp:862: warning: format not a string literal and no format arguments
make[2]: *** [kifo.o] Error 1
make[2]: Leaving directory `/work/src/k9copy-1.0.0/src'
make[1]: *** [all-recursive] Error 1
make[1]: Leaving directory `/work/src/k9copy-1.0.0'
make: *** [all] Error 2

0.3b compile fine :)

crazy - Oct 16 2005